id,hh_id,country,sec_area,tert_area,round,smpl_weight,sex,age,edc_level,edc,residence,preg_lact,breastfeeding,hh_head,wgt,wgt_method,hgt,hgt_method,bmi_adults,bmi_children,bmi_cat,misrep,pa,pa_cat,smok,special_diet,special_diet_other,clin_diet,clin_diet_other,note,bmi_chld
1,257,Burkina Faso,1,2,1,.85115558,2,40,,,1,2,,,48.799999,1,153.5,1,20.711094,,2,2,,,,,.,,.,,
1,257,Burkina Faso,1,2,2,.85115558,2,40,,,1,2,,,46.099998,1,153.5,1,19.565193,,2,2,,,,,.,,.,,
2,463,Burkina Faso,1,2,1,.85115558,2,32,,,1,2,,,70.199997,1,172.8,1,23.509836,,2,2,,,,,.,,.,,
2,463,Burkina Faso,1,2,2,.85115558,2,32,,,1,0,,,66.300003,1,172.8,1,22.203735,,2,2,,,,,.,,.,,
3,13,Burkina Faso,1,2,1,.85115558,1,4,,,1,,,,15.1,1,97.099998,1,,,,2,,,,,.,,.,,16.015427
3,13,Burkina Faso,1,2,2,.85115558,1,4,,,1,,,,15.4,1,98.900002,1,,,,2,,,,,.,,.,,15.744473
4,185,Burkina Faso,1,2,1,.85115558,2,30,,,1,0,,,42.900002,1,154,1,18.089054,,1,2,,,,,.,,.,,
4,185,Burkina Faso,1,2,2,.85115558,2,30,,,1,0,,,42.700001,1,154,1,18.004723,,1,2,,,,,.,,.,,
5,136,Burkina Faso,2,1,1,1.1488445,2,27,,,1,2,,,52.200001,1,154.25,1,21.939169,,2,2,,,,,.,,.,,
5,136,Burkina Faso,2,1,2,1.1488445,2,27,,,1,2,,,49.799999,1,154.25,1,20.930471,,2,2,,,,,.,,.,,
6,106,Burkina Faso,1,2,1,.85115558,2,41,,,1,2,,,49.799999,1,161.05,1,19.200293,,2,2,,,,,.,,.,,
6,106,Burkina Faso,1,2,2,.85115558,2,41,,,1,2,,,48.799999,1,161.05,1,18.814745,,2,3,,,,,.,,.,,
7,415,Burkina Faso,1,2,1,.85115558,2,35,,,1,2,,,59.900002,1,159.89999,1,23.427715,,2,2,,,,,.,,.,,
7,415,Burkina Faso,1,2,2,.85115558,2,35,,,1,2,,,61.799999,1,159.89999,1,24.17083,,2,2,,,,,.,,.,,
8,138,Burkina Faso,1,2,1,.85115558,2,3,,,1,,,,15.5,1,94,1,,,,2,,,,,.,,.,,17.541874
8,138,Burkina Faso,1,2,2,.85115558,2,4,,,1,,,,17.200001,1,96.099998,1,,,,2,,,,,.,,.,,18.624374
9,383,Burkina Faso,2,1,1,1.1488445,1,4,,,1,,,,14.1,1,97.699997,1,,,,2,,,,,.,,.,,14.771685
9,383,Burkina Faso,2,1,2,1.1488445,1,4,,,1,,,,15.5,1,101.3,1,,,,2,,,,,.,,.,,15.104724
10,209,Burkina Faso,2,1,1,1.1488445,2,3,,,1,,,,12.8,1,88.599998,1,,,,3,,,,,.,,.,,16.305817
10,209,Burkina Faso,2,1,2,1.1488445,2,3,,,1,,,,13.7,1,90.900002,1,,,,2,,,,,.,,.,,16.580315
11,49,Burkina Faso,2,1,1,1.1488445,2,27,,,1,2,,,59.599998,1,167.05,1,21.357641,,2,2,,,,,.,,.,,
11,49,Burkina Faso,2,1,2,1.1488445,2,27,,,1,2,,,63.099998,1,167.05,1,22.611864,,2,2,,,,,.,,.,,
12,66,Burkina Faso,1,2,1,.85115558,2,5,,,1,,,,13.7,1,99,1,,,,2,,,,,.,,.,,13.978166
12,66,Burkina Faso,1,2,2,.85115558,2,5,,,1,,,,14.3,1,100.8,1,,,,2,,,,,.,,.,,14.073915
13,341,Burkina Faso,1,2,1,.85115558,2,5,,,1,,,,15.3,1,105.1,1,,,,3,,,,,.,,.,,13.851156
13,341,Burkina Faso,1,2,2,.85115558,2,5,,,1,,,,15.2,1,106.8,1,,,,2,,,,,.,,.,,13.326038
14,348,Burkina Faso,2,1,1,1.1488445,1,5,,,1,,,,15.4,1,100.8,1,,,,2,,,,,.,,.,,15.156525
14,348,Burkina Faso,2,1,2,1.1488445,1,5,,,1,,,,16.299999,1,102.5,1,,,,2,,,,,.,,.,,15.514574
15,113,Burkina Faso,1,2,1,.85115558,2,30,,,1,2,,,37.400002,1,143.45,1,18.174837,,1,1,,,,,.,,.,,
15,113,Burkina Faso,1,2,2,.85115558,2,30,,,1,2,,,39.299999,1,143.45,1,19.098156,,2,2,,,,,.,,.,,
16,344,Burkina Faso,1,2,1,.85115558,2,31,,,1,0,,,65.699997,1,163.39999,1,24.607147,,2,2,,,,,.,,.,,
16,344,Burkina Faso,1,2,2,.85115558,2,31,,,1,1,,,63.900002,1,163.39999,1,23.932981,,2,2,,,,,.,,.,,
17,319,Burkina Faso,2,1,1,1.1488445,2,3,,,1,,,,11.7,1,82,1,,,,2,,,,,.,,.,,17.400356
17,319,Burkina Faso,2,1,2,1.1488445,2,3,,,1,,,,12.2,1,84.900002,1,,,,2,,,,,.,,.,,16.925613
18,135,Burkina Faso,1,2,1,.85115558,2,46,,,1,0,,,36.599998,1,157.05,1,14.839018,,1,2,,,,,.,,.,,
18,135,Burkina Faso,1,2,2,.85115558,2,46,,,1,0,,,36.200001,1,157.05,1,14.676844,,1,2,,,,,.,,.,,
19,330,Burkina Faso,1,2,1,.85115558,2,26,,,1,2,,,50,1,155.25,1,20.744682,,2,2,,,,,.,,.,,
19,330,Burkina Faso,1,2,2,.85115558,2,26,,,1,2,,,51.900002,1,155.25,1,21.53298,,2,2,,,,,.,,.,,
20,318,Burkina Faso,1,2,1,.85115558,2,3,,,1,,,,14,1,93,1,,,,2,,,,,.,,.,,16.186842
20,318,Burkina Faso,1,2,2,.85115558,2,4,,,1,,,,14.4,1,97.199997,1,,,,2,,,,,.,,.,,15.24158
21,30,Burkina Faso,2,1,1,1.1488445,2,33,,,1,2,,,53.200001,1,161.05,1,20.511158,,2,2,,,,,.,,.,,
21,30,Burkina Faso,2,1,2,1.1488445,2,33,,,1,2,,,54,1,161.05,1,20.819595,,2,2,,,,,.,,.,,
22,280,Burkina Faso,1,2,1,.85115558,1,3,,,1,,,,12.2,1,87,1,,,,2,,,,,.,,.,,16.118378
22,280,Burkina Faso,1,2,2,.85115558,1,4,,,1,,,,12.7,1,88.900002,1,,,,2,,,,,.,,.,,16.06942
23,194,Burkina Faso,1,2,1,.85115558,2,37,,,1,1,,,45.099998,1,158.2,1,18.020365,,1,2,,,,,.,,.,,
23,194,Burkina Faso,1,2,2,.85115558,2,37,,,1,1,,,47.700001,1,158.2,1,19.059235,,2,2,,,,,.,,.,,
24,425,Burkina Faso,1,2,1,.85115558,2,35,,,1,2,,,49.799999,1,157.7,1,20.024698,,2,2,,,,,.,,.,,
24,425,Burkina Faso,1,2,2,.85115558,2,35,,,1,2,,,50.099998,1,157.7,1,20.145329,,2,2,,,,,.,,.,,
25,100,Burkina Faso,2,1,1,1.1488445,1,3,,,1,,,,13.3,1,95.199997,1,,,,2,,,,,.,,.,,14.674989
25,100,Burkina Faso,2,1,2,1.1488445,1,3,,,1,,,,14.7,1,98.5,1,,,,2,,,,,.,,.,,15.151125
26,73,Burkina Faso,2,1,1,1.1488445,2,4,,,1,,,,14.3,1,100,1,,,,2,,,,,.,,.,,14.3
26,73,Burkina Faso,2,1,2,1.1488445,2,4,,,1,,,,15.3,1,103.1,1,,,,2,,,,,.,,.,,14.393755
27,380,Burkina Faso,1,2,1,.85115558,2,20,,,1,2,,,48,1,162.5,1,18.177515,,1,2,,,,,.,,.,,
27,380,Burkina Faso,1,2,2,.85115558,2,20,,,1,2,,,48.599998,1,162.5,1,18.404734,,1,2,,,,,.,,.,,
28,431,Burkina Faso,2,1,1,1.1488445,1,3,,,1,,,,10.1,1,84.099998,1,,,,2,,,,,.,,.,,14.28004
28,431,Burkina Faso,2,1,2,1.1488445,1,3,,,1,,,,10.7,1,87,1,,,,2,,,,,.,,.,,14.13661
29,117,Burkina Faso,1,2,1,.85115558,2,3,,,1,,,,13.2,1,88.400002,1,,,,2,,,,,.,,.,,16.891544
29,117,Burkina Faso,1,2,2,.85115558,2,3,,,1,,,,14.2,1,93,1,,,,2,,,,,.,,.,,16.418083
30,83,Burkina Faso,2,1,1,1.1488445,1,4,,,1,,,,18.4,1,102.7,1,,,,2,,,,,.,,.,,17.44524
30,83,Burkina Faso,2,1,2,1.1488445,1,4,,,1,,,,19.299999,1,106.9,1,,,,2,,,,,.,,.,,16.88892
31,290,Burkina Faso,2,1,1,1.1488445,2,34,,,1,2,,,54.099998,1,160.75,1,20.936077,,2,2,,,,,.,,.,,
31,290,Burkina Faso,2,1,2,1.1488445,2,34,,,1,2,,,51.599998,1,160.75,1,19.968605,,2,2,,,,,.,,.,,
32,32,Burkina Faso,1,2,1,.85115558,2,22,,,1,1,,,62.299999,1,166.45,1,22.486427,,2,2,,,,,.,,.,,
32,32,Burkina Faso,1,2,2,.85115558,2,22,,,1,2,,,56.200001,1,166.45,1,20.284706,,2,2,,,,,.,,.,,
33,386,Burkina Faso,2,1,1,1.1488445,2,4,,,1,,,,13.2,1,93.199997,1,,,,2,,,,,.,,.,,15.196449
33,386,Burkina Faso,2,1,2,1.1488445,2,4,,,1,,,,13,1,95.400002,1,,,,2,,,,,.,,.,,14.283893
34,121,Burkina Faso,2,1,1,1.1488445,1,3,,,1,,,,13.2,1,89.199997,1,,,,2,,,,,.,,.,,16.589918
34,121,Burkina Faso,2,1,2,1.1488445,1,4,,,1,,,,13.6,1,90.400002,1,,,,2,,,,,.,,.,,16.641867
35,266,Burkina Faso,2,1,1,1.1488445,2,31,,,1,2,,,57.599998,1,159.10001,1,22.755274,,2,2,,,,,.,,.,,
35,266,Burkina Faso,2,1,2,1.1488445,2,31,,,1,2,,,55.799999,1,159.10001,1,22.044172,,2,2,,,,,.,,.,,
36,26,Burkina Faso,1,2,1,.85115558,2,4,,,1,,,,12.5,1,92,1,,,,2,,,,,.,,.,,14.768431
36,26,Burkina Faso,1,2,2,.85115558,2,4,,,1,,,,13.1,1,93.800003,1,,,,2,,,,,.,,.,,14.889003
37,328,Burkina Faso,1,2,1,.85115558,2,35,,,1,2,,,73.199997,1,173.95,1,24.191467,,2,2,,,,,.,,.,,
37,328,Burkina Faso,1,2,2,.85115558,2,35,,,1,2,,,74.400002,1,173.95,1,24.588051,,2,2,,,,,.,,.,,
38,30,Burkina Faso,2,1,1,1.1488445,2,5,,,1,,,,13.6,1,100.7,1,,,,3,,,,,.,,.,,13.411582
38,30,Burkina Faso,2,1,2,1.1488445,2,5,,,1,,,,14.4,1,102.1,1,,,,2,,,,,.,,.,,13.813731
39,472,Burkina Faso,2,1,1,1.1488445,1,5,,,1,,,,17,1,108.8,1,,,,2,,,,,.,,.,,14.361213
39,472,Burkina Faso,2,1,2,1.1488445,1,5,,,1,,,,17.5,1,111.5,1,,,,2,,,,,.,,.,,14.076294
40,343,Burkina Faso,1,2,1,.85115558,2,3,,,1,,,,12,1,91.199997,1,,,,2,,,,,.,,.,,14.427517
40,343,Burkina Faso,1,2,2,.85115558,2,4,,,1,,,,12.7,1,94.400002,1,,,,2,,,,,.,,.,,14.251472
41,353,Burkina Faso,2,1,1,1.1488445,1,3,,,1,,,,11.9,1,85.199997,1,,,,2,,,,,.,,.,,16.393353
41,353,Burkina Faso,2,1,2,1.1488445,1,3,,,1,,,,12.3,1,87.099998,1,,,,2,,,,,.,,.,,16.213203
42,86,Burkina Faso,1,2,1,.85115558,2,32,,,1,2,,,75.400002,1,172.75,1,25.265928,,3,2,,,,,.,,.,,
42,86,Burkina Faso,1,2,2,.85115558,2,32,,,1,2,,,71,1,172.75,1,23.791523,,2,2,,,,,.,,.,,
43,57,Burkina Faso,2,1,1,1.1488445,2,21,,,1,2,,,52.299999,1,161.8,1,19.977661,,2,2,,,,,.,,.,,
43,57,Burkina Faso,2,1,2,1.1488445,2,21,,,1,2,,,48,1,161.8,1,18.335138,,1,2,,,,,.,,.,,
44,320,Burkina Faso,1,2,1,.85115558,2,4,,,1,,,,15.6,1,91.800003,1,,,,2,,,,,.,,.,,18.511398
44,320,Burkina Faso,1,2,2,.85115558,2,4,,,1,,,,15.7,1,94.099998,1,,,,2,,,,,.,,.,,17.730476
45,475,Burkina Faso,1,2,1,.85115558,2,4,,,1,,,,13.3,1,95,1,,,,2,,,,,.,,.,,14.736842
45,475,Burkina Faso,1,2,2,.85115558,2,5,,,1,,,,12.6,1,96.5,1,,,,2,,,,,.,,.,,13.530565
46,6,Burkina Faso,2,1,1,1.1488445,2,37,,,1,0,,,64.099998,1,168.3,1,22.630272,,2,2,,,,,.,,.,,
46,6,Burkina Faso,2,1,2,1.1488445,2,37,,,1,0,,,65.199997,1,168.3,1,23.018621,,2,2,,,,,.,,.,,
47,365,Burkina Faso,2,1,1,1.1488445,2,3,,,1,,,,12.8,1,96.699997,1,,,,2,,,,,.,,.,,13.688538
47,365,Burkina Faso,2,1,2,1.1488445,2,3,,,1,,,,13.8,1,100.9,1,,,,2,,,,,.,,.,,13.554914
48,339,Burkina Faso,1,2,1,.85115558,2,4,,,1,,,,13,1,93.400002,1,,,,2,,,,,.,,.,,14.902172
48,339,Burkina Faso,1,2,2,.85115558,2,4,,,1,,,,14.2,1,95.699997,1,,,,2,,,,,.,,.,,15.50474
49,40,Burkina Faso,1,2,1,.85115558,1,4,,,1,,,,13,1,89,1,,,,2,,,,,.,,.,,16.412069
49,40,Burkina Faso,1,2,2,.85115558,1,4,,,1,,,,13,1,90.900002,1,,,,2,,,,,.,,.,,15.733146
50,32,Burkina Faso,1,2,1,.85115558,1,4,,,1,,,,17.9,1,,,,,,2,,,,,.,,.,,
50,32,Burkina Faso,1,2,2,.85115558,1,4,,,1,,,,17.200001,1,101.3,1,,,,3,,,,,.,,.,,16.761372
51,460,Burkina Faso,2,1,1,1.1488445,1,3,,,1,,,,11.9,1,89,1,,,,2,,,,,.,,.,,15.023355
51,460,Burkina Faso,2,1,2,1.1488445,1,4,,,1,,,,11.8,1,92.300003,1,,,,2,,,,,.,,.,,13.850919
52,288,Burkina Faso,1,2,1,.85115558,2,27,,,1,2,,,47.299999,1,160.5,1,18.361622,,1,2,,,,,.,,.,,
52,288,Burkina Faso,1,2,2,.85115558,2,27,,,1,2,,,46.400002,1,160.5,1,18.012249,,1,2,,,,,.,,.,,
53,165,Burkina Faso,2,1,1,1.1488445,1,5,,,1,,,,13.7,1,100.1,1,,,,2,,,,,.,,.,,13.672641
53,165,Burkina Faso,2,1,2,1.1488445,1,5,,,1,,,,14.8,1,101.5,1,,,,2,,,,,.,,.,,14.365794
54,286,Burkina Faso,1,2,1,.85115558,2,27,,,1,1,,,52.900002,1,165.25,1,19.371923,,2,2,,,,,.,,.,,
54,286,Burkina Faso,1,2,2,.85115558,2,27,,,1,1,,,56.5,1,165.25,1,20.690239,,2,2,,,,,.,,.,,
55,150,Burkina Faso,2,1,1,1.1488445,2,22,,,1,1,,,42.299999,1,150.85001,1,18.58873,,2,2,,,,,.,,.,,
55,150,Burkina Faso,2,1,2,1.1488445,2,22,,,1,1,,,46,1,150.85001,1,20.214693,,2,2,,,,,.,,.,,
56,16,Burkina Faso,1,2,1,.85115558,2,5,,,1,,,,16.299999,1,100.8,1,,,,2,,,,,.,,.,,16.042295
56,16,Burkina Faso,1,2,2,.85115558,2,5,,,1,,,,15.6,1,101.5,1,,,,2,,,,,.,,.,,15.142323
57,194,Burkina Faso,1,2,1,.85115558,2,4,,,1,,,,9.8999996,1,83.099998,1,,,,2,,,,,.,,.,,14.33617
57,194,Burkina Faso,1,2,2,.85115558,2,4,,,1,,,,10.5,1,87.199997,1,,,,2,,,,,.,,.,,13.808813
58,143,Burkina Faso,1,2,1,.85115558,2,28,,,1,2,,,48.700001,1,160.8,1,18.83462,,2,2,,,,,.,,.,,
58,143,Burkina Faso,1,2,2,.85115558,2,28,,,1,2,,,47.599998,1,160.8,1,18.409197,,1,2,,,,,.,,.,,
59,350,Burkina Faso,2,1,1,1.1488445,2,4,,,1,,,,13.8,1,101.8,1,,,,2,,,,,.,,.,,13.316298
59,350,Burkina Faso,2,1,2,1.1488445,2,4,,,1,,,,14.4,1,104.5,1,,,,2,,,,,.,,.,,13.186511
60,187,Burkina Faso,1,2,1,.85115558,1,4,,,1,,,,13.5,1,95,1,,,,2,,,,,.,,.,,14.958448
60,187,Burkina Faso,1,2,2,.85115558,1,4,,,1,,,,14.8,1,97.199997,1,,,,2,,,,,.,,.,,15.664957
61,139,Burkina Faso,2,1,1,1.1488445,2,30,,,1,2,,,53.5,1,166.89999,1,19.206186,,2,2,,,,,.,,.,,
61,139,Burkina Faso,2,1,2,1.1488445,2,30,,,1,2,,,61,1,166.89999,1,21.898642,,2,2,,,,,.,,.,,
62,171,Burkina Faso,1,2,1,.85115558,2,4,,,1,,,,12.6,1,97.5,1,,,,2,,,,,.,,.,,13.254438
62,171,Burkina Faso,1,2,2,.85115558,2,4,,,1,,,,13,1,97.099998,1,,,,2,,,,,.,,.,,13.788116
63,470,Burkina Faso,2,1,1,1.1488445,1,4,,,1,,,,11.6,1,93.199997,1,,,,2,,,,,.,,.,,13.354456
63,470,Burkina Faso,2,1,2,1.1488445,1,4,,,1,,,,12.1,1,95.400002,1,,,,2,,,,,.,,.,,13.295009
64,238,Burkina Faso,2,1,1,1.1488445,2,28,,,1,2,,,60.900002,1,163.45,1,22.795414,,2,3,,,,,.,,.,,
64,238,Burkina Faso,2,1,2,1.1488445,2,28,,,1,2,,,60.799999,1,163.45,1,22.757982,,2,2,,,,,.,,.,,
65,1,Burkina Faso,1,2,1,.85115558,2,27,,,1,1,,,63.400002,1,171.2,1,21.631258,,2,1,,,,,.,,.,,
65,1,Burkina Faso,1,2,2,.85115558,2,27,,,1,2,,,59.299999,1,171.2,1,20.232389,,2,2,,,,,.,,.,,
66,404,Burkina Faso,2,1,1,1.1488445,2,24,,,1,2,,,53.700001,1,154.25,1,22.569605,,2,2,,,,,.,,.,,
66,404,Burkina Faso,2,1,2,1.1488445,2,24,,,1,2,,,52.900002,1,154.25,1,22.233372,,2,2,,,,,.,,.,,
67,271,Burkina Faso,1,2,1,.85115558,2,34,,,1,0,,,50.200001,1,164.8,1,18.483717,,1,2,,,,,.,,.,,
67,271,Burkina Faso,1,2,2,.85115558,2,34,,,1,0,,,49.099998,1,164.8,1,18.078693,,1,2,,,,,.,,.,,
68,425,Burkina Faso,1,2,1,.85115558,2,3,,,1,,,,13.7,1,93,1,,,,2,,,,,.,,.,,15.839981
68,425,Burkina Faso,1,2,2,.85115558,2,4,,,1,,,,13.5,1,94.5,1,,,,2,,,,,.,,.,,15.117158
69,448,Burkina Faso,1,2,1,.85115558,1,4,,,1,,,,16.6,1,99.099998,1,,,,2,,,,,.,,.,,16.902884
69,448,Burkina Faso,1,2,2,.85115558,1,4,,,1,,,,17.200001,1,101.4,1,,,,2,,,,,.,,.,,16.728329
70,28,Burkina Faso,2,1,1,1.1488445,2,4,,,1,,,,16.4,1,98.900002,1,,,,2,,,,,.,,.,,16.76684
70,28,Burkina Faso,2,1,2,1.1488445,2,4,,,1,,,,18.700001,1,102.3,1,,,,2,,,,,.,,.,,17.868591
71,123,Burkina Faso,1,2,1,.85115558,1,5,,,1,,,,15.2,1,104.7,1,,,,2,,,,,.,,.,,13.86597
71,123,Burkina Faso,1,2,2,.85115558,1,5,,,1,,,,15.1,1,105.4,1,,,,2,,,,,.,,.,,13.592387
72,166,Burkina Faso,1,2,1,.85115558,2,27,,,1,0,,,48.299999,1,160.2,1,18.820108,,2,3,,,,,.,,.,,
72,166,Burkina Faso,1,2,2,.85115558,2,27,,,1,1,,,47.799999,1,160.2,1,18.625282,,2,2,,,,,.,,.,,
73,104,Burkina Faso,2,1,1,1.1488445,1,3,,,1,,,,11.3,1,85.599998,1,,,,2,,,,,.,,.,,15.421654
73,104,Burkina Faso,2,1,2,1.1488445,1,4,,,1,,,,12,1,87.599998,1,,,,2,,,,,.,,.,,15.637706
74,318,Burkina Faso,1,2,1,.85115558,2,23,,,1,1,,,58,1,167.5,1,20.672756,,2,2,,,,,.,,.,,
74,318,Burkina Faso,1,2,2,.85115558,2,23,,,1,0,,,56.700001,1,167.5,1,20.2094,,2,2,,,,,.,,.,,
75,84,Burkina Faso,1,2,1,.85115558,2,5,,,1,,,,16.9,1,105.1,1,,,,2,,,,,.,,.,,15.299643
75,84,Burkina Faso,1,2,2,.85115558,2,5,,,1,,,,17.200001,1,105.9,1,,,,2,,,,,.,,.,,15.336863
76,352,Burkina Faso,2,1,1,1.1488445,2,35,,,1,0,,,45.599998,1,161.95,1,17.386131,,1,3,,,,,.,,.,,
76,352,Burkina Faso,2,1,2,1.1488445,2,35,,,1,1,,,46.799999,1,161.95,1,17.84366,,1,2,,,,,.,,.,,
77,378,Burkina Faso,1,2,1,.85115558,1,3,,,1,,,,12.9,1,,,,,,2,,,,,.,,.,,
77,378,Burkina Faso,1,2,2,.85115558,1,4,,,1,,,,13.8,1,91.900002,1,,,,2,,,,,.,,.,,16.339849
78,12,Burkina Faso,2,1,1,1.1488445,2,26,,,1,2,,,73.900002,1,185.10001,1,21.569078,,2,2,,,,,.,,.,,
78,12,Burkina Faso,2,1,2,1.1488445,2,26,,,1,2,,,76,1,185.10001,1,22.182001,,2,2,,,,,.,,.,,
79,240,Burkina Faso,2,1,1,1.1488445,2,26,,,1,2,,,59.200001,1,169.7,1,20.556919,,2,2,,,,,.,,.,,
79,240,Burkina Faso,2,1,2,1.1488445,2,26,,,1,2,,,59.799999,1,169.7,1,20.765266,,2,3,,,,,.,,.,,
80,71,Burkina Faso,2,1,1,1.1488445,2,23,,,1,2,,,56.700001,1,164.45,1,20.965988,,2,2,,,,,.,,.,,
80,71,Burkina Faso,2,1,2,1.1488445,2,23,,,1,2,,,55,1,164.45,1,20.337378,,2,2,,,,,.,,.,,
81,324,Burkina Faso,2,1,1,1.1488445,1,3,,,1,,,,12.5,1,87.400002,1,,,,2,,,,,.,,.,,16.363913
81,324,Burkina Faso,2,1,2,1.1488445,1,3,,,1,,,,13.4,1,90,1,,,,2,,,,,.,,.,,16.543209
82,411,Burkina Faso,1,2,1,.85115558,2,33,,,1,0,,,53.299999,1,162.14999,1,20.271847,,2,2,,,,,.,,.,,
82,411,Burkina Faso,1,2,2,.85115558,2,33,,,1,0,,,52.099998,1,162.14999,1,19.815445,,2,2,,,,,.,,.,,
83,169,Burkina Faso,1,2,1,.85115558,2,27,,,1,2,,,62.400002,1,159.5,1,24.528061,,2,2,,,,,.,,.,,
83,169,Burkina Faso,1,2,2,.85115558,2,27,,,1,2,,,65.199997,1,159.5,1,25.628677,,3,3,,,,,.,,.,,
84,91,Burkina Faso,2,1,1,1.1488445,1,3,,,1,,,,13.9,1,92.099998,1,,,,2,,,,,.,,.,,16.386852
84,91,Burkina Faso,2,1,2,1.1488445,1,4,,,1,,,,13.9,1,93.900002,1,,,,2,,,,,.,,.,,15.764623
85,332,Burkina Faso,1,2,1,.85115558,1,5,,,1,,,,15.1,1,101.2,1,,,,2,,,,,.,,.,,14.744021
85,332,Burkina Faso,1,2,2,.85115558,1,5,,,1,,,,12.7,1,102,1,,,,2,,,,,.,,.,,12.206843
86,402,Burkina Faso,2,1,1,1.1488445,2,27,,,1,1,,,48.299999,1,152.60001,1,20.741398,,2,2,,,,,.,,.,,
86,402,Burkina Faso,2,1,2,1.1488445,2,27,,,1,2,,,43.299999,1,152.60001,1,18.594255,,2,2,,,,,.,,.,,
87,289,Burkina Faso,1,2,1,.85115558,2,5,,,1,,,,14.9,1,102,1,,,,2,,,,,.,,.,,14.321415
87,289,Burkina Faso,1,2,2,.85115558,2,5,,,1,,,,16.1,1,102.9,1,,,,2,,,,,.,,.,,15.205304
88,476,Burkina Faso,2,1,1,1.1488445,2,37,,,1,0,,,51.400002,1,170.95,1,17.588343,,1,2,,,,,.,,.,,
88,476,Burkina Faso,2,1,2,1.1488445,2,37,,,1,1,,,53.200001,1,170.95,1,18.204277,,1,2,,,,,.,,.,,
89,223,Burkina Faso,2,1,1,1.1488445,2,36,,,1,0,,,91.900002,1,167.10001,1,32.912628,,4,2,,,,,.,,.,,
89,223,Burkina Faso,2,1,2,1.1488445,2,36,,,1,0,,,92.599998,1,167.10001,1,33.163322,,4,2,,,,,.,,.,,
90,473,Burkina Faso,1,2,1,.85115558,2,32,,,1,0,,,49.299999,1,165.75,1,17.944851,,1,2,,,,,.,,.,,
90,473,Burkina Faso,1,2,2,.85115558,2,32,,,1,0,,,46.5,1,165.75,1,16.925671,,1,2,,,,,.,,.,,
91,307,Burkina Faso,1,2,1,.85115558,2,3,,,1,,,,14.6,1,100.4,1,,,,2,,,,,.,,.,,14.483897
91,307,Burkina Faso,1,2,2,.85115558,2,4,,,1,,,,14.5,1,101.6,1,,,,2,,,,,.,,.,,14.046904
92,457,Burkina Faso,1,2,1,.85115558,2,22,,,1,2,,,51.799999,1,161.60001,1,19.835676,,2,2,,,,,.,,.,,
92,457,Burkina Faso,1,2,2,.85115558,2,22,,,1,2,,,52.400002,1,161.60001,1,20.065434,,2,2,,,,,.,,.,,
93,8,Burkina Faso,1,2,1,.85115558,2,4,,,1,,,,12.6,1,87.5,1,,,,2,,,,,.,,.,,16.457144
93,8,Burkina Faso,1,2,2,.85115558,2,5,,,1,,,,11.9,1,89.599998,1,,,,3,,,,,.,,.,,14.822824
94,448,Burkina Faso,1,2,1,.85115558,2,25,,,1,2,,,52,1,160.35001,1,20.223923,,2,2,,,,,.,,.,,
94,448,Burkina Faso,1,2,2,.85115558,2,25,,,1,2,,,51.599998,1,160.35001,1,20.068354,,2,2,,,,,.,,.,,
95,48,Burkina Faso,2,1,1,1.1488445,2,42,,,1,2,,,62.5,1,173.39999,1,20.786524,,2,2,,,,,.,,.,,
95,48,Burkina Faso,2,1,2,1.1488445,2,42,,,1,2,,,65.400002,1,173.39999,1,21.751019,,2,2,,,,,.,,.,,
96,259,Burkina Faso,2,1,1,1.1488445,2,25,,,1,1,,,54.099998,1,160.14999,1,21.093245,,2,2,,,,,.,,.,,
96,259,Burkina Faso,2,1,2,1.1488445,2,25,,,1,2,,,54.599998,1,160.14999,1,21.288193,,2,2,,,,,.,,.,,
97,207,Burkina Faso,1,2,1,.85115558,2,29,,,1,0,,,58,1,160,1,22.65625,,2,2,,,,,.,,.,,
97,207,Burkina Faso,1,2,2,.85115558,2,29,,,1,0,,,57.599998,1,160,1,22.5,,2,2,,,,,.,,.,,
98,389,Burkina Faso,2,1,1,1.1488445,2,42,,,1,2,,,61.799999,1,174.35001,1,20.330336,,2,2,,,,,.,,.,,
98,389,Burkina Faso,2,1,2,1.1488445,2,42,,,1,2,,,62.200001,1,174.35001,1,20.461924,,2,2,,,,,.,,.,,
99,406,Burkina Faso,2,1,1,1.1488445,2,21,,,1,0,,,49.599998,1,163.2,1,18.622644,,2,3,,,,,.,,.,,
99,406,Burkina Faso,2,1,2,1.1488445,2,21,,,1,2,,,53.799999,1,163.2,1,20.199564,,2,3,,,,,.,,.,,
100,120,Burkina Faso,1,2,1,.85115558,2,5,,,1,,,,14.1,1,99.900002,1,,,,2,,,,,.,,.,,14.128242
100,120,Burkina Faso,1,2,2,.85115558,2,5,,,1,,,,14.9,1,101.9,1,,,,2,,,,,.,,.,,14.349537
101,219,Burkina Faso,1,2,1,.85115558,2,42,,,1,0,,,53.799999,1,165.35001,1,19.677677,,2,2,,,,,.,,.,,
101,219,Burkina Faso,1,2,2,.85115558,2,42,,,1,0,,,50.599998,1,165.35001,1,18.507257,,2,2,,,,,.,,.,,
102,140,Burkina Faso,1,2,1,.85115558,2,22,,,1,2,,,46.900002,1,159.55,1,18.423801,,1,2,,,,,.,,.,,
102,140,Burkina Faso,1,2,2,.85115558,2,22,,,1,2,,,46,1,159.55,1,18.070251,,1,3,,,,,.,,.,,
103,16,Burkina Faso,1,2,1,.85115558,2,30,,,1,0,,,51.5,1,157.75,1,20.695147,,2,2,,,,,.,,.,,
103,16,Burkina Faso,1,2,2,.85115558,2,30,,,1,0,,,51.5,1,157.75,1,20.695147,,2,2,,,,,.,,.,,
104,275,Burkina Faso,1,2,1,.85115558,2,4,,,1,,,,13.1,1,94.699997,1,,,,2,,,,,.,,.,,14.607348
104,275,Burkina Faso,1,2,2,.85115558,2,4,,,1,,,,13.4,1,98.199997,1,,,,2,,,,,.,,.,,13.895745
105,119,Burkina Faso,1,2,1,.85115558,1,4,,,1,,,,13.7,1,91.699997,1,,,,2,,,,,.,,.,,16.292282
105,119,Burkina Faso,1,2,2,.85115558,1,4,,,1,,,,14.1,1,94.199997,1,,,,2,,,,,.,,.,,15.88976
106,23,Burkina Faso,1,2,1,.85115558,2,29,,,1,0,,,54.599998,1,158.75,1,21.665323,,2,2,,,,,.,,.,,
106,23,Burkina Faso,1,2,2,.85115558,2,29,,,1,0,,,54.599998,1,158.75,1,21.665323,,2,2,,,,,.,,.,,
107,363,Burkina Faso,1,2,1,.85115558,2,3,,,1,,,,11.5,1,93.5,1,,,,2,,,,,.,,.,,13.154509
107,363,Burkina Faso,1,2,2,.85115558,2,4,,,1,,,,12.1,1,94,1,,,,2,,,,,.,,.,,13.693979
108,471,Burkina Faso,2,1,1,1.1488445,1,3,,,1,,,,14.3,1,98.599998,1,,,,2,,,,,.,,.,,14.708969
108,471,Burkina Faso,2,1,2,1.1488445,1,3,,,1,,,,14.3,1,101.2,1,,,,2,,,,,.,,.,,13.962881
109,243,Burkina Faso,2,1,1,1.1488445,2,22,,,1,1,,,58,1,154.05,1,24.440189,,2,2,,,,,.,,.,,
109,243,Burkina Faso,2,1,2,1.1488445,2,22,,,1,2,,,51.599998,1,154.05,1,21.74334,,2,2,,,,,.,,.,,
110,191,Burkina Faso,2,1,1,1.1488445,2,24,,,1,1,,,61.599998,1,162.10001,1,23.443079,,2,2,,,,,.,,.,,
110,191,Burkina Faso,2,1,2,1.1488445,2,24,,,1,2,,,54.400002,1,162.10001,1,20.70298,,2,2,,,,,.,,.,,
111,79,Burkina Faso,2,1,1,1.1488445,2,3,,,1,,,,10,1,,,,,,2,,,,,.,,.,,
111,79,Burkina Faso,2,1,2,1.1488445,2,4,,,1,,,,11.4,1,86.300003,1,,,,2,,,,,.,,.,,15.306758
112,307,Burkina Faso,1,2,1,.85115558,2,32,,,1,2,,,56.599998,1,163.2,1,21.250841,,2,2,,,,,.,,.,,
112,307,Burkina Faso,1,2,2,.85115558,2,32,,,1,2,,,54,1,163.2,1,20.274654,,2,2,,,,,.,,.,,
113,193,Burkina Faso,2,1,1,1.1488445,1,4,,,1,,,,13.5,1,91.699997,1,,,,2,,,,,.,,.,,16.05444
113,193,Burkina Faso,2,1,2,1.1488445,1,5,,,1,,,,16,1,94.900002,1,,,,2,,,,,.,,.,,17.765913
114,418,Burkina Faso,2,1,1,1.1488445,2,23,,,1,2,,,47,1,158.7,1,18.661392,,2,2,,,,,.,,.,,
114,418,Burkina Faso,2,1,2,1.1488445,2,23,,,1,2,,,48,1,158.7,1,19.058443,,2,2,,,,,.,,.,,
115,321,Burkina Faso,1,2,1,.85115558,1,4,,,1,,,,15.6,1,102.1,1,,,,2,,,,,.,,.,,14.964876
115,321,Burkina Faso,1,2,2,.85115558,1,4,,,1,,,,15.6,1,103.6,1,,,,2,,,,,.,,.,,14.534668
116,175,Burkina Faso,2,1,1,1.1488445,2,25,,,1,2,,,38.299999,1,151.5,1,16.686817,,1,2,,,,,.,,.,,
116,175,Burkina Faso,2,1,2,1.1488445,2,25,,,1,2,,,37.799999,1,151.5,1,16.468973,,1,3,,,,,.,,.,,
117,235,Burkina Faso,2,1,1,1.1488445,2,22,,,1,2,,,48.700001,1,160.60001,1,18.881559,,2,2,,,,,.,,.,,
117,235,Burkina Faso,2,1,2,1.1488445,2,22,,,1,2,,,48.299999,1,160.60001,1,18.726475,,2,2,,,,,.,,.,,
118,466,Burkina Faso,2,1,1,1.1488445,2,3,,,1,,,,13.7,1,94.900002,1,,,,2,,,,,.,,.,,15.212063
118,466,Burkina Faso,2,1,2,1.1488445,2,4,,,1,,,,14.6,1,98.099998,1,,,,2,,,,,.,,.,,15.171023
119,181,Burkina Faso,2,1,1,1.1488445,1,4,,,1,,,,14.9,1,100.5,1,,,,3,,,,,.,,.,,14.75211
120,477,Burkina Faso,1,2,1,.85115558,1,3,,,1,,,,13.8,1,88.099998,1,,,,2,,,,,.,,.,,17.779818
120,477,Burkina Faso,1,2,2,.85115558,1,4,,,1,,,,13,1,90.599998,1,,,,2,,,,,.,,.,,15.837513
121,365,Burkina Faso,2,1,1,1.1488445,2,24,,,1,1,,,63.700001,1,160.85001,1,24.620523,,2,2,,,,,.,,.,,
121,365,Burkina Faso,2,1,2,1.1488445,2,24,,,1,0,,,62,1,160.85001,1,23.963461,,2,2,,,,,.,,.,,
122,455,Burkina Faso,2,1,1,1.1488445,2,26,,,1,0,,,49,1,159.35001,1,19.297094,,2,2,,,,,.,,.,,
122,455,Burkina Faso,2,1,2,1.1488445,2,26,,,1,0,,,50.099998,1,159.35001,1,19.730293,,2,2,,,,,.,,.,,
123,159,Burkina Faso,1,2,1,.85115558,1,3,,,1,,,,12.3,1,89.400002,1,,,,2,,,,,.,,.,,15.389697
123,159,Burkina Faso,1,2,2,.85115558,1,3,,,1,,,,13,1,92.400002,1,,,,2,,,,,.,,.,,15.226476
124,459,Burkina Faso,2,1,1,1.1488445,1,5,,,1,,,,14,1,98.099998,1,,,,2,,,,,.,,.,,14.547556
124,459,Burkina Faso,2,1,2,1.1488445,1,5,,,1,,,,14.8,1,99.099998,1,,,,2,,,,,.,,.,,15.070041
125,139,Burkina Faso,2,1,1,1.1488445,2,4,,,1,,,,14.8,1,94.599998,1,,,,2,,,,,.,,.,,16.537867
125,139,Burkina Faso,2,1,2,1.1488445,2,4,,,1,,,,15.4,1,97.5,1,,,,2,,,,,.,,.,,16.199867
126,69,Burkina Faso,1,2,1,.85115558,2,5,,,1,,,,15.1,1,99.699997,1,,,,2,,,,,.,,.,,15.19101
126,69,Burkina Faso,1,2,2,.85115558,2,5,,,1,,,,15.5,1,102.6,1,,,,2,,,,,.,,.,,14.72438
127,115,Burkina Faso,1,2,1,.85115558,2,5,,,1,,,,15.4,1,97.199997,1,,,,3,,,,,.,,.,,16.300022
127,115,Burkina Faso,1,2,2,.85115558,2,5,,,1,,,,15.8,1,100.9,1,,,,2,,,,,.,,.,,15.519394
128,256,Burkina Faso,1,2,1,.85115558,2,30,,,1,2,,,57.400002,1,165,1,21.083563,,2,2,,,,,.,,.,,
128,256,Burkina Faso,1,2,2,.85115558,2,30,,,1,2,,,58.400002,1,165,1,21.450872,,2,2,,,,,.,,.,,
129,449,Burkina Faso,2,1,1,1.1488445,1,5,,,1,,,,15.4,1,97.800003,1,,,,2,,,,,.,,.,,16.100634
129,449,Burkina Faso,2,1,2,1.1488445,1,5,,,1,,,,16.1,1,99.699997,1,,,,2,,,,,.,,.,,16.197039
130,269,Burkina Faso,1,2,1,.85115558,1,4,,,1,,,,12.5,1,95,1,,,,2,,,,,.,,.,,13.850415
130,269,Burkina Faso,1,2,2,.85115558,1,5,,,1,,,,12.2,1,96.099998,1,,,,2,,,,,.,,.,,13.210312