id,hh_id,country,sec_area,tert_area,round,smpl_weight,sex,age,edc_level,edc,residence,preg_lact,breastfeeding,hh_head,wgt,wgt_method,hgt,hgt_method,bmi_adults,bmi_children,bmi_cat,misrep,pa,pa_cat,smok,special_diet,special_diet_other,clin_diet,clin_diet_other,note,id_sector,bmi_chld,pa_cat_adol,pa_cat_adult,energy_overall,totalpro_overall,carb_overall,fiber_overall,totalfat_overall,sfa_overall,ca_overall,fe_overall,feaj_overall,zn_overall,znaj_overall,fol_overall,vitb12_overall,vitb12aj_overall,vitc_overall,vita_overall,vitaj_overall
1015000100101101,10150001001011,Ecuador,1,10150,1,274.2405405405405,1,63,2,2,2,,,1015000100101101,,,,,,,,,,,,,,,,,10150001001,,,2,,,,,,,,,,,,,,,,,
1015000100101102,10150001001011,Ecuador,1,10150,1,274.2405405405405,2,60,1,6,2,,,1015000100101101,,,,,,,,,,,,,,,,,10150001001,,,2,,,,,,,,,,,,,,,,,
1015000100101103,10150001001011,Ecuador,1,10150,1,274.2405405405405,1,40,1,6,2,,,1015000100101101,80.75,1,161,1,31.152348,,4,,,,2,,,,,,10150001001,,,3,1752.380000000001,69.85809999999995,239.9349999999999,10.2557,57.33770000000003,28.18620000000002,217.8690000000001,6.849620000000002,13.71249999999999,7.992349999999992,12.82680000000001,127.8119999999999,3.00284,2.9435,74.03459999999997,277.5110000000003,223.0939999999997
1015000100101104,10150001001011,Ecuador,1,10150,1,274.2405405405405,1,35,2,6,2,,,1015000100101101,81,1,172.14999,1,27.331974,,3,,,,1,,,,,,10150001001,,,3,,,,,,,,,,,,,,,,,
1015000100101105,10150001001011,Ecuador,1,10150,1,274.2405405405405,1,2,2,,2,,,1015000100101101,16.299999,1,96.5,1,,,,,,,,,,,,,10150001001,17.503824,,,1449.690000000001,57.48659999999997,226.6509999999999,12.7885,35.5202,12.83249999999999,461.5489999999996,7.302570000000001,10.3272,6.620810000000004,8.037350000000002,119.7199999999999,1.38758,1.38885,89.44239999999995,309.9989999999999,154.027
1015000100101106,10150001001011,Ecuador,1,10150,1,274.2405405405405,2,39,2,3,2,,,1015000100101101,,,,,,,,,,,3,,,,,,10150001001,,,1,,,,,,,,,,,,,,,,,
1015000100102101,10150001001021,Ecuador,1,10150,1,274.2405405405405,1,53,1,6,2,,,1015000100102101,,,,,,,,,,,,,,,,,10150001001,,,2,,,,,,,,,,,,,,,,,
1015000100102102,10150001001021,Ecuador,1,10150,1,274.2405405405405,2,51,1,6,2,,,1015000100102101,,,,,,,,,,,,,,,,,10150001001,,,2,,,,,,,,,,,,,,,,,
1015000100102103,10150001001021,Ecuador,1,10150,1,274.2405405405405,2,29,3,5,2,,,1015000100102101,58.599998,1,155.10001,1,24.359814,,2,,,,3,,,,,,10150001001,,,3,,,,,,,,,,,,,,,,,
1015000100102104,10150001001021,Ecuador,1,10150,1,274.2405405405405,2,18,1,3,2,,,1015000100102101,61.150002,1,158.5,1,,,,,,,3,,,,,,10150001001,24.340973,2,,,,,,,,,,,,,,,,,,
1015000100103101,10150001001031,Ecuador,1,10150,1,274.2405405405405,1,36,2,6,2,,,1015000100103101,79.800003,1,166.14999,1,28.906948,,3,,,,1,,,,,,10150001001,,,2,1501.839999999999,44.66470000000002,241.7070000000001,11.3137,41.74150000000002,20.90089999999999,161.6660000000001,5.885690000000003,7.930659999999995,6.024200000000005,7.575979999999996,183.213,1.585619999999999,1.58097,36.72440000000004,162.6379999999999,123.618
1015000100103102,10150001001031,Ecuador,1,10150,1,274.2405405405405,2,25,3,4,2,,,1015000100103101,56.5,1,119.4,1,39.631435,,4,,,,2,,,,,,10150001001,,,2,1254.160000000001,34.91959999999997,185.1809999999999,6.115119999999997,38.38689999999998,19.61030000000001,140.6360000000001,4.436119999999998,6.721239999999996,5.488820000000001,7.522330000000005,103.3539999999999,1.949449999999999,1.935450000000001,29.7388,157.0079999999999,122.802
1015000100103103,10150001001031,Ecuador,1,10150,1,274.2405405405405,2,1,2,,2,,,1015000100103101,9.0500002,1,72.050003,1,,,,,,,,,,,,,10150001001,17.43334,,,,,,,,,,,,,,,,,,,
1015000100105101,10150001001051,Ecuador,1,10150,1,274.2405405405405,1,28,1,2,2,,,1015000100105101,61.900002,1,164.55,1,22.860981,,2,,,,1,,,,,,10150001001,,,2,,,,,,,,,,,,,,,,,
1015000100105102,10150001001051,Ecuador,1,10150,1,274.2405405405405,2,21,2,8,2,,,1015000100105101,51.400002,1,155.3,1,21.311804,,2,,,,3,,,,,,10150001001,,,2,1844.410000000001,61.21319999999998,315.4350000000001,7.158829999999996,36.0924,14.41930000000001,296.854,6.274079999999999,10.0403,7.087189999999999,8.934220000000003,101.636,2.01274,1.984520000000001,44.13329999999998,187.1660000000001,149.185
1015000100105103,10150001001051,Ecuador,1,10150,1,274.2405405405405,1,0,1,,2,,3,1015000100105101,6.9000001,1,62.25,1,,,,,,,,,,,,,10150001001,17.806164,,,,,,,,,,,,,,,,,,,
1015000100106101,10150001001061,Ecuador,1,10150,1,274.2405405405405,2,49,1,6,2,,,1015000100106101,,,,,,,,,,,,,,,,,10150001001,,,2,,,,,,,,,,,,,,,,,
1015000100106102,10150001001061,Ecuador,1,10150,1,274.2405405405405,2,16,1,10,2,,,1015000100106101,50.5,1,152.25,1,,,,,,,2,,,,,,10150001001,21.785963,2,,,,,,,,,,,,,,,,,,
1015000100107101,10150001001071,Ecuador,1,10150,1,274.2405405405405,1,23,1,6,2,,,1015000100107101,75,1,156.25,1,30.719999,,4,,,,1,,,,,,10150001001,,,2,,,,,,,,,,,,,,,,,
1015000100107102,10150001001071,Ecuador,1,10150,1,274.2405405405405,2,22,1,6,2,,,1015000100107101,,,,,,,,,,,3,,,,,,10150001001,,,1,,,,,,,,,,,,,,,,,
1015000100107103,10150001001071,Ecuador,1,10150,1,274.2405405405405,2,4,1,,2,,,1015000100107101,14.549999,1,94.150002,1,,,,,,,,,,,,,10150001001,16.414297,,,1176.330000000001,34.9415,197.6630000000002,8.335090000000001,31.08180000000001,13.41199999999999,352.2360000000002,3.805639999999998,6.084300000000004,4.349140000000002,5.477380000000001,128.1109999999999,1.77999,1.75909,86.17920000000002,251.6850000000001,174.8819999999999
1015000100110101,10150001001101,Ecuador,1,10150,1,274.2405405405405,1,57,1,6,2,,,1015000100110101,,,,,,,,,,,,,,,,,10150001001,,,2,,,,,,,,,,,,,,,,,
1015000100110102,10150001001101,Ecuador,1,10150,1,274.2405405405405,2,53,1,6,2,,,1015000100110101,,,,,,,,,,,,,,,,,10150001001,,,2,,,,,,,,,,,,,,,,,
1015000100110103,10150001001101,Ecuador,1,10150,1,274.2405405405405,2,16,1,3,2,,,1015000100110101,37.849998,1,145.35001,1,,,,,,,3,,,,,,10150001001,17.915781,2,,,,,,,,,,,,,,,,,,
1015000100111101,10150001001111,Ecuador,1,10150,1,274.2405405405405,1,29,2,6,2,,,1015000100111101,75.800003,1,163.45001,1,28.372612,,3,,,,1,,,,,,10150001001,,,3,,,,,,,,,,,,,,,,,
1015000100111102,10150001001111,Ecuador,1,10150,1,274.2405405405405,2,28,2,4,2,,,1015000100111101,71.350006,1,156.10001,1,29.281153,,3,,,,3,,,,,,10150001001,,,3,,,,,,,,,,,,,,,,,
1015000100111103,10150001001111,Ecuador,1,10150,1,274.2405405405405,1,7,2,3,2,,,1015000100111101,28.549999,1,123.6,1,,,,,,,,,,,,,10150001001,18.688272,,,,,,,,,,,,,,,,,,,
1015000100111104,10150001001111,Ecuador,1,10150,1,274.2405405405405,1,4,2,,2,,,1015000100111101,17.849998,1,104.85,1,,,,,,,,,,,,,10150001001,16.236834,,,,,,,,,,,,,,,,,,,
1015000100112101,10150001001121,Ecuador,1,10150,1,274.2405405405405,1,31,3,1,2,,,1015000100112101,85.099998,1,157.10001,1,34.480785,,4,,,,2,,,,,,10150001001,,,3,,,,,,,,,,,,,,,,,
1015000100112102,10150001001121,Ecuador,1,10150,1,274.2405405405405,2,26,3,2,2,,,1015000100112101,47.049999,1,146.45,1,21.937185,,2,,,,2,,,,,,10150001001,,,2,,,,,,,,,,,,,,,,,
1015000100112103,10150001001121,Ecuador,1,10150,1,274.2405405405405,2,7,3,3,2,,,1015000100112101,20.5,1,108.45,1,,,,,,,,,,,,,10150001001,17.429895,,,,,,,,,,,,,,,,,,,
1015000100112104,10150001001121,Ecuador,1,10150,1,274.2405405405405,2,6,3,2,2,,,1015000100112101,20.150002,1,111.45,1,,,,,,,,,,,,,10150001001,16.222395,,,,,,,,,,,,,,,,,,,
1015000100113101,10150001001131,Ecuador,1,10150,1,274.2405405405405,2,41,2,6,2,,,1015000100113101,64.149994,1,162.35001,1,24.338398,,2,,,,2,,,,,,10150001001,,,2,,,,,,,,,,,,,,,,,
1015000100113102,10150001001131,Ecuador,1,10150,1,274.2405405405405,2,15,2,1,2,,,1015000100113101,57.349998,1,158.10001,1,,,,,,,3,,,,,,10150001001,22.944027,1,,,,,,,,,,,,,,,,,,
1015000100113103,10150001001131,Ecuador,1,10150,1,274.2405405405405,2,7,2,3,2,,,1015000100113101,23.799999,1,123.85001,1,,,,,,,,,,,,,10150001001,15.516183,,,,,,,,,,,,,,,,,,,
1015000100432101,10150001004321,Ecuador,1,10150,1,228.5337837837838,1,25,3,5,2,,,1015000100432101,62.900002,1,174.10001,1,20.751671,,2,,,,2,,,,,,10150001004,,,2,,,,,,,,,,,,,,,,,
1015000300501101,10150003005011,Ecuador,1,10150,1,228.5337837837838,1,49,1,6,2,,,1015000300501101,,,,,,,,,,,,,,,,,10150003005,,,2,,,,,,,,,,,,,,,,,
1015000300501102,10150003005011,Ecuador,1,10150,1,228.5337837837838,2,38,1,6,2,,,1015000300501101,59.849998,1,152.79999,1,25.634066,,3,,,,3,,,,,,10150003005,,,3,,,,,,,,,,,,,,,,,
1015000300501103,10150003005011,Ecuador,1,10150,1,228.5337837837838,2,21,2,1,2,,,1015000300501101,,,,,,,,,,,,,,,,,10150003005,,,2,,,,,,,,,,,,,,,,,
1015000300501104,10150003005011,Ecuador,1,10150,1,228.5337837837838,1,15,1,1,2,,,1015000300501101,60.599998,1,168.20001,1,,,,,,,3,,,,,,10150003005,21.420053,2,,,,,,,,,,,,,,,,,,
1015000300501105,10150003005011,Ecuador,1,10150,1,228.5337837837838,1,0,1,,2,,,1015000300501101,,,,,,,,,,,,,,,,,10150003005,,,,,,,,,,,,,,,,,,,,
1015000300501106,10150003005011,Ecuador,1,10150,1,228.5337837837838,2,9,1,5,2,,,1015000300501101,30.1,1,129.45,1,,,,,,,,,,,,,10150003005,17.962318,,,,,,,,,,,,,,,,,,,
1015000300502101,10150003005021,Ecuador,1,10150,1,228.5337837837838,1,53,1,6,2,,,1015000300502101,,,,,,,,,,,,,,,,,10150003005,,,2,,,,,,,,,,,,,,,,,
1015000300502102,10150003005021,Ecuador,1,10150,1,228.5337837837838,2,53,1,6,2,,,1015000300502101,,,,,,,,,,,,,,,,,10150003005,,,2,,,,,,,,,,,,,,,,,
1015000300502103,10150003005021,Ecuador,1,10150,1,228.5337837837838,1,23,1,3,2,,,1015000300502101,,,,,,,,,,,,,,,,,10150003005,,,2,,,,,,,,,,,,,,,,,
1015000300502104,10150003005021,Ecuador,1,10150,1,228.5337837837838,2,20,3,2,2,,,1015000300502101,57.599998,1,160.60001,1,22.332191,,2,,,,3,,,,,,10150003005,,,3,,,,,,,,,,,,,,,,,
1015000300503101,10150003005031,Ecuador,1,10150,1,228.5337837837838,1,59,2,3,2,,,1015000300503101,,,,,,,,,,,,,,,,,10150003005,,,2,,,,,,,,,,,,,,,,,
1015000300503102,10150003005031,Ecuador,1,10150,1,228.5337837837838,2,46,2,2,2,,,1015000300503101,,,,,,,,,,,,,,,,,10150003005,,,2,,,,,,,,,,,,,,,,,
1015000300503103,10150003005031,Ecuador,1,10150,1,228.5337837837838,2,22,3,3,2,,,1015000300503101,47.200001,1,155,1,19.646202,,2,,,,3,,,,,,10150003005,,,3,1547.28,63.50770000000003,181.6869999999999,6.987380000000001,58.57439999999998,21.6277,273.0690000000001,5.499290000000001,11.2031,7.02686,10.7773,88.95440000000002,2.66189,2.572789999999999,52.2134,285.3739999999999,233.64
1015000300503104,10150003005031,Ecuador,1,10150,1,228.5337837837838,2,23,,,2,,,1015000300503101,,,,,,,,,,,,,,,,,10150003005,,,2,,,,,,,,,,,,,,,,,
1015000300508101,10150003005081,Ecuador,1,10150,1,228.5337837837838,1,59,1,6,2,,,1015000300508101,92.699997,1,168.3,1,32.727398,,4,,,,1,,,,,,10150003005,,,3,1204.509999999999,42.38660000000002,169.058,4.643720000000001,40.59889999999999,14.8657,388.2309999999998,4.194580000000001,6.120149999999998,3.708569999999999,4.681910000000001,66.6639,2.793529999999998,2.769800000000002,50.92610000000001,241.7529999999999,202.895
1015000300508102,10150003005081,Ecuador,1,10150,1,228.5337837837838,2,61,2,4,2,,,1015000300508101,,,,,,,,,,,,,,,,,10150003005,,,2,,,,,,,,,,,,,,,,,
1015000300508103,10150003005081,Ecuador,1,10150,1,228.5337837837838,1,32,2,1,2,,,1015000300508101,66.300003,1,164.3,1,24.560568,,2,,,,2,,,,,,10150003005,,,3,,,,,,,,,,,,,,,,,
1015000300508104,10150003005081,Ecuador,1,10150,1,228.5337837837838,2,11,1,6,2,,,1015000300508101,31.799999,1,142.25,1,,,,,,,3,,,,,,10150003005,15.715296,2,,2120.39,64.5779,263.3729999999998,12.11009999999999,89.57739999999998,48.65679999999998,630.2909999999998,8.888329999999998,12.94780000000001,6.864249999999999,8.568119999999995,224.1509999999999,3.803569999999997,3.771379999999998,66.52520000000003,281.4840000000002,223.1189999999999
1015000300509101,10150003005091,Ecuador,1,10150,1,228.5337837837838,1,29,2,10,2,,,1015000300509101,84,1,165,1,30.853994,,4,,,,1,,,,,,10150003005,,,2,,,,,,,,,,,,,,,,,
1015000300509102,10150003005091,Ecuador,1,10150,1,228.5337837837838,2,27,1,6,2,,,1015000300509101,51.849998,1,148.5,1,23.512339,,2,,,,3,,,,,,10150003005,,,2,,,,,,,,,,,,,,,,,
1015000300509103,10150003005091,Ecuador,1,10150,1,228.5337837837838,2,4,2,,2,,,1015000300509101,16.75,1,104.85001,1,,,,,,,,,,,,,10150003005,15.236243,,,,,,,,,,,,,,,,,,,
1015000300509104,10150003005091,Ecuador,1,10150,1,228.5337837837838,2,0,2,,2,,3,1015000300509101,6.1999998,1,62.700001,1,,,,,,,,,,,,,10150003005,15.770904,,,,,,,,,,,,,,,,,,,
1015000300509105,10150003005091,Ecuador,1,10150,1,228.5337837837838,1,15,2,1,2,,,1015000300509101,88.599998,1,175.60001,1,,,,,,,3,,,,,,10150003005,28.733244,2,,,,,,,,,,,,,,,,,,
1015000300510101,10150003005101,Ecuador,1,10150,1,228.5337837837838,1,36,1,6,2,,,1015000300510101,64.5,1,164.7,1,23.777847,,2,,,,1,,,,,,10150003005,,,2,1454.92,54.60529999999999,224.6880000000001,4.737679999999999,38.4112,20.781,137.3510000000001,4.338340000000001,7.994740000000004,4.67225,6.213620000000001,90.33490000000003,3.840620000000001,3.762929999999999,59.82150000000001,185.431,122.472
1015000300510102,10150003005101,Ecuador,1,10150,1,228.5337837837838,2,32,2,3,2,,,1015000300510101,55.599998,1,146.95,1,25.747532,,3,,,,2,,,,,,10150003005,,,1,1558.040000000001,40.79189999999997,280.0519999999999,4.53788,31.30349999999999,13.70670000000001,186.4610000000001,4.965090000000003,7.033350000000003,5.600889999999996,6.980089999999998,125.5830000000001,2.077730000000001,2.029130000000002,67.49060000000003,275.036,181.5880000000001
1015000300510103,10150003005101,Ecuador,1,10150,1,228.5337837837838,2,12,1,7,2,,,1015000300510101,43.700001,1,141.5,1,,,,,,,3,,,,,,10150003005,21.82572,1,,1756.5,50.18089999999998,284.6149999999999,5.377960000000001,45.18460000000002,23.05470000000001,202.966,5.946420000000002,8.559020000000002,6.201229999999999,7.63151,117.748,2.288269999999999,2.2632,43.7073,254.515,184.9720000000001
1015000300510104,10150003005101,Ecuador,1,10150,1,228.5337837837838,1,1,1,,2,,,1015000300510101,12.1,1,81.099998,1,,,,,,,,,,,,,10150003005,18.39686,,,,,,,,,,,,,,,,,,,
1015000300531101,10150003005311,Ecuador,1,10150,1,228.5337837837838,1,34,3,4,2,,,1015000300531101,79.25,1,162.3,1,30.085846,,4,,,,3,,,,,,10150003005,,,2,,,,,,,,,,,,,,,,,
1015000300531102,10150003005311,Ecuador,1,10150,1,228.5337837837838,2,29,2,6,2,,,1015000300531101,67.449997,1,154.64999,1,28.202143,,3,,,,3,,,,,,10150003005,,,1,,,,,,,,,,,,,,,,,
1015000300532101,10150003005321,Ecuador,1,10150,1,228.5337837837838,1,41,3,3,2,,,1015000300532101,84.800003,1,164.8,1,31.22349,,4,,,,2,,,,,,10150003005,,,3,1538.36,47.63250000000006,259.7530000000003,7.834369999999995,38.58770000000003,12.15139999999999,282.9019999999996,5.921550000000008,9.435420000000011,5.617999999999997,6.947709999999987,159.6200000000001,4.429660000000007,4.356510000000008,95.28470000000009,220.902,157.5490000000002
1015000300532102,10150003005321,Ecuador,1,10150,1,228.5337837837838,2,39,3,4,2,,,1015000300532101,75.149994,1,161.64999,1,28.759251,,3,,,,3,,,,,,10150003005,,,3,1699.990000000001,51.375,258.7459999999998,9.328179999999991,53.05659999999994,22.5308,437.4739999999997,5.955320000000003,8.448950000000007,6.002080000000002,7.129560000000006,138.0469999999998,4.116269999999996,4.01988,37.78389999999997,330.1049999999997,268.4120000000001
1015000300532103,10150003005321,Ecuador,1,10150,1,228.5337837837838,1,16,3,2,2,,,1015000300532101,60.25,1,170.39999,1,,,,,,,2,,,,,,10150003005,20.74999,2,,1989.830000000002,56.27460000000002,307.2039999999998,7.282969999999999,60.05409999999998,26.09969999999999,467.2150000000001,6.575049999999999,9.305900000000005,7.017149999999997,8.237320000000006,137.6850000000001,4.008690000000001,3.906180000000004,36.07989999999997,328.5079999999999,281.5390000000001
1015000300532104,10150003005321,Ecuador,1,10150,1,228.5337837837838,2,15,3,1,2,,,1015000300532101,62.349998,1,162.45,1,,,,,,,3,,,,,,10150003005,23.626371,2,,,,,,,,,,,,,,,,,,
1015000300532105,10150003005321,Ecuador,1,10150,1,228.5337837837838,1,8,3,4,2,,,1015000300532101,27.450001,1,132.55,1,,,,,,,,,,,,,10150003005,15.623664,,,,,,,,,,,,,,,,,,,
1015000300533101,10150003005331,Ecuador,1,10150,1,228.5337837837838,2,43,1,6,2,,,1015000300533101,69.550003,1,152.55,1,29.886339,,3,,,,3,,,,,,10150003005,,,3,,,,,,,,,,,,,,,,,
1015000300533102,10150003005331,Ecuador,1,10150,1,228.5337837837838,2,22,2,3,2,,,1015000300533101,,,,,,,,,,,,,,,,,10150003005,,,2,,,,,,,,,,,,,,,,,
1015000300533103,10150003005331,Ecuador,1,10150,1,228.5337837837838,2,18,1,3,2,,,1015000300533101,69.900002,1,173.45,1,,,,,,,2,,,,,,10150003005,23.234247,3,3,,,,,,,,,,,,,,,,,
1015000300534101,10150003005341,Ecuador,1,10150,1,228.5337837837838,1,30,3,2,2,,,1015000300534101,76.099998,1,168.5,1,26.803089,,3,,,,1,,,,,,10150003005,,,1,,,,,,,,,,,,,,,,,
1015000300534102,10150003005341,Ecuador,1,10150,1,228.5337837837838,2,26,2,1,2,,,1015000300534101,70.5,1,159.05,1,27.869024,,3,,,,3,,,,,,10150003005,,,2,1809.96,59.05339999999999,249.2070000000001,9.400399999999996,66.55630000000001,28.74270000000001,645.2050000000006,6.067569999999996,8.577200000000003,6.668319999999996,8.258039999999996,180.3760000000001,4.516850000000002,4.267439999999996,92.04460000000006,580.0420000000003,463.2140000000001
1015000300534103,10150003005341,Ecuador,1,10150,1,228.5337837837838,2,2,3,,2,,,1015000300534101,13.7,1,93,1,,,,,,,,,,,,,10150003005,15.839981,,,,,,,,,,,,,,,,,,,
1015000300534104,10150003005341,Ecuador,1,10150,1,228.5337837837838,1,0,3,,2,,3,1015000300534101,8.1000004,1,62.450001,1,,,,,,,,,,,,,10150003005,20.769218,,,,,,,,,,,,,,,,,,,
1015000300535101,10150003005351,Ecuador,1,10150,1,228.5337837837838,2,27,2,6,2,,,1015000300535101,,,,,,,,,,,,,,,,,10150003005,,,2,,,,,,,,,,,,,,,,,
1015000300535102,10150003005351,Ecuador,1,10150,1,228.5337837837838,2,57,2,3,2,,,1015000300535101,,,,,,,,,,,,,,,,,10150003005,,,2,,,,,,,,,,,,,,,,,
1015000300535103,10150003005351,Ecuador,1,10150,1,228.5337837837838,2,17,2,2,2,,,1015000300535101,53.650002,1,152.05,1,,,,,,,3,,,,,,10150003005,23.205818,2,,,,,,,,,,,,,,,,,,
1015000300535104,10150003005351,Ecuador,1,10150,1,228.5337837837838,1,7,2,1,2,,,1015000300535101,22.1,1,119.2,1,,,,,,,,,,,,,10150003005,15.553918,,,,,,,,,,,,,,,,,,,
1015000300536101,10150003005361,Ecuador,1,10150,1,228.5337837837838,1,59,2,6,2,,,1015000300536101,,,,,,,,,,,,,,,,,10150003005,,,2,,,,,,,,,,,,,,,,,
1015000300536102,10150003005361,Ecuador,1,10150,1,228.5337837837838,2,54,1,6,2,,,1015000300536101,,,,,,,,,,,,,,,,,10150003005,,,2,,,,,,,,,,,,,,,,,
1015000300536103,10150003005361,Ecuador,1,10150,1,228.5337837837838,2,30,3,3,2,,,1015000300536101,61.900002,1,156.29999,1,25.338026,,3,,,,2,,,,,,10150003005,,,2,,,,,,,,,,,,,,,,,
1015000300536104,10150003005361,Ecuador,1,10150,1,228.5337837837838,1,29,3,2,2,,,1015000300536101,72.5,1,173.55,1,24.070702,,2,,,,2,,,,,,10150003005,,,3,,,,,,,,,,,,,,,,,
1015000300536105,10150003005361,Ecuador,1,10150,1,228.5337837837838,1,4,2,,2,,,1015000300536101,19.700001,1,112.05,1,,,,,,,,,,,,,10150003005,15.690706,,,,,,,,,,,,,,,,,,,
1015000300536106,10150003005361,Ecuador,1,10150,1,228.5337837837838,1,4,2,,2,,,1015000300536101,16.75,1,98.849998,1,,,,,,,,,,,,,10150003005,17.142,,,,,,,,,,,,,,,,,,,
1015000600232101,10150006002321,Ecuador,1,10150,1,228.5337837837837,1,34,1,6,2,,,1015000600232101,,,,,,,,,,,,,,,,,10150006002,,,2,,,,,,,,,,,,,,,,,
1015000600232102,10150006002321,Ecuador,1,10150,1,228.5337837837837,2,29,2,5,2,,,1015000600232101,64.300003,1,150.5,1,28.388208,,3,,,,1,,,,,,10150006002,,,2,,,,,,,,,,,,,,,,,
1015000600232103,10150006002321,Ecuador,1,10150,1,228.5337837837837,1,8,1,4,2,,,1015000600232101,,,,,,,,,,,,,,,,,10150006002,,,,,,,,,,,,,,,,,,,,
1015000600232104,10150006002321,Ecuador,1,10150,1,228.5337837837837,1,7,1,4,2,,,1015000600232101,,,,,,,,,,,,,,,,,10150006002,,,,,,,,,,,,,,,,,,,,
1015000600232105,10150006002321,Ecuador,1,10150,1,228.5337837837837,2,2,1,,2,,,1015000600232101,13.5,1,89.199997,1,,,,,,,,,,,,,10150006002,16.966963,,,,,,,,,,,,,,,,,,,
1015000600232106,10150006002321,Ecuador,1,10150,1,228.5337837837837,1,0,1,,2,,,1015000600232101,9.1000004,1,73.699997,1,,,,,,,,,,,,,10150006002,16.753536,,,,,,,,,,,,,,,,,,,
1015000600233101,10150006002331,Ecuador,1,10150,1,228.5337837837837,2,63,1,2,2,,,1015000600233101,,,,,,,,,,,,,,,,,10150006002,,,2,,,,,,,,,,,,,,,,,
1015000600233102,10150006002331,Ecuador,1,10150,1,228.5337837837837,1,32,3,6,2,,,1015000600233101,69.5,1,165.3,1,25.435431,,3,,,,1,,,,,,10150006002,,,3,,,,,,,,,,,,,,,,,
1015000600236101,10150006002361,Ecuador,1,10150,1,228.5337837837837,2,29,1,6,2,,,1015000600236101,52.400002,1,145.5,1,24.751717,,2,,,,3,,,,,,10150006002,,,2,,,,,,,,,,,,,,,,,
1015000600236102,10150006002361,Ecuador,1,10150,1,228.5337837837837,2,10,1,6,2,,,1015000600236101,30.1,1,134.89999,1,,,,,,,3,,,,,,10150006002,16.540272,3,,,,,,,,,,,,,,,,,,
1015000600401101,10150006004011,Ecuador,1,10150,1,228.5337837837838,2,32,3,4,2,,,1015000600401101,55.5,1,153.89999,1,23.432346,,2,,,,2,,,,,,10150006004,,,1,,,,,,,,,,,,,,,,,
1015000600403101,10150006004031,Ecuador,1,10150,1,228.5337837837838,2,44,1,3,2,,,1015000600403101,63.549999,1,153.5,1,26.971107,,3,,,,3,,,,,,10150006004,,,2,,,,,,,,,,,,,,,,,
1015000600403102,10150006004031,Ecuador,1,10150,1,228.5337837837838,1,21,2,1,2,,,1015000600403101,,,,,,,,,,,,,,,,,10150006004,,,2,,,,,,,,,,,,,,,,,
1015000600403103,10150006004031,Ecuador,1,10150,1,228.5337837837838,1,19,1,3,2,,,1015000600403101,77.800003,1,177.3,1,,,,,,,3,,,,,,10150006004,24.749254,2,3,1919.01,58.36539999999999,280.299,14.44220000000001,60.35349999999996,22.9584,351.1059999999998,8.511650000000001,14.0648,7.931099999999997,10.5023,223.0169999999999,3.24888,3.2434,36.47619999999998,45.36649999999998,44.07280000000002
1015000600403104,10150006004031,Ecuador,1,10150,1,228.5337837837838,1,17,1,2,2,,,1015000600403101,52.200001,1,160.85001,1,,,,,,,2,,,,,,10150006004,20.175688,3,,2578.800000000002,80.86130000000001,320.9940000000001,12.25259999999999,98.7084,40.96669999999997,390.9490000000001,7.637249999999996,15.1081,11.3137,17.00049999999999,158.0039999999999,4.29767,4.188670000000001,76.31500000000004,170.723,135.445
1015000600405101,10150006004051,Ecuador,1,10150,1,228.5337837837838,1,35,2,6,2,,,1015000600405101,70.400002,1,156.75,1,28.652174,,3,,,,2,,,,,,10150006004,,,3,,,,,,,,,,,,,,,,,
1015000600405102,10150006004051,Ecuador,1,10150,1,228.5337837837838,2,30,2,6,2,,,1015000600405101,66.599998,1,161.7,1,25.471481,,3,,,,1,,,,,,10150006004,,,3,1100.089999999999,31.11710000000001,154.5050000000001,5.89631,38.20759999999997,17.24900000000001,283.3739999999999,3.37075,4.856760000000001,3.911249999999998,4.661169999999999,84.11740000000006,1.87261,1.87233,44.94309999999997,193.5259999999999,156.155
1015000600405103,10150006004051,Ecuador,1,10150,1,228.5337837837838,2,13,2,10,2,,,1015000600405101,51.349998,1,150.89999,1,,,,,,,3,,,,,,10150006004,22.550802,1,,999.8669999999992,31.5444,161.7910000000001,6.369969999999998,32.71130000000001,12.66699999999999,319.1830000000002,3.843709999999999,5.123870000000003,3.94801,4.716829999999997,96.3442,1.86694,1.847900000000001,47.25160000000003,216.8249999999999,181.4750000000001
1015000600405104,10150006004051,Ecuador,1,10150,1,228.5337837837838,2,10,2,6,2,,,1015000600405101,,,,,,,,,,,,,,,,,10150006004,,,,,,,,,,,,,,,,,,,,
1015000600405105,10150006004051,Ecuador,1,10150,1,228.5337837837838,1,3,2,,2,,,1015000600405101,17.150002,1,98.900002,1,,,,,,,,,,,,,10150006004,17.533619,,,,,,,,,,,,,,,,,,,
1015000600406101,10150006004061,Ecuador,1,10150,1,228.5337837837838,2,68,1,1,2,,,1015000600406101,,,,,,,,,,,,,,,,,10150006004,,,2,,,,,,,,,,,,,,,,,
1015000600406102,10150006004061,Ecuador,1,10150,1,228.5337837837838,1,12,1,8,2,,,1015000600406101,39.650002,1,147.14999,1,,,,,,,3,,,,,,10150006004,18.311449,3,,1158.400000000001,31.54750000000001,201.403,12.6962,31.70849999999999,12.51069999999999,397.9210000000001,5.779790000000002,7.26486,4.74373,5.61895,176.669,1.7241,1.7239,81.62480000000004,535.072,255.6679999999999
1015000600408101,10150006004081,Ecuador,1,10150,1,228.5337837837838,2,27,2,6,2,,,1015000600408101,66.199997,1,152.89999,1,28.316725,,3,,,,2,,,,,,10150006004,,,1,,,,,,,,,,,,,,,,,