id,hh_id,country,sec_area,tert_area,round,smpl_weight,sex,age,edc_level,edc,residence,preg_lact,breastfeeding,hh_head,wgt,wgt_method,hgt,hgt_method,bmi_adults,bmi_children,bmi_cat,misrep,pa,pa_cat,smok,special_diet,special_diet_other,clin_diet,clin_diet_other,note,year,bmi_chld
4703,99713,Germany,North Rhine-Westphalia,Ruhr region,,,2,12.416667,1,,2,,,,49.150002,1,160.60001,1,,19.05603,,2,420.85715,1,3,,,,,,2015,19.05603
4703,99713,Germany,North Rhine-Westphalia,Ruhr region,,,2,13.325,1,,2,,,,50.25,1,165.39999,1,,18.368135,,2,153.64285,1,3,0,,0,,,2015,18.368135
4703,99713,Germany,North Rhine-Westphalia,Ruhr region,,,2,14.45,2,,2,,,,52.349998,1,167.3,1,,18.703583,,2,183.10715,1,3,0,,0,,,2017,18.703581
4703,99713,Germany,North Rhine-Westphalia,Ruhr region,,,2,15.208333,2,,2,,,,51.549999,1,168.2,1,,18.221188,,2,322.5,1,3,0,,0,,,2017,18.221188
4703,99713,Germany,North Rhine-Westphalia,Ruhr region,,,2,16.683332,2,,2,,,,52.900002,1,168.89999,1,,18.543699,,2,470.14285,1,3,0,,0,,,2019,18.543701
5288,22260,Germany,North Rhine-Westphalia,Ruhr region,,,2,9.2749996,1,,2,,,,39.849998,1,144,1,,19.217785,,2,229.71428,1,3,0,,0,,,2016,19.217785
5288,22260,Germany,North Rhine-Westphalia,Ruhr region,,,2,11.425,1,,2,,,,56.799999,1,162.7,1,,21.457209,,2,660.42859,2,3,0,,0,,,2018,21.457209
14217,82208,Germany,North Rhine-Westphalia,Ruhr region,,,1,16.25,2,,2,,,,64.199997,1,175.2,1,,20.915432,,2,224.57143,1,3,,,,,,2015,20.91543
14217,82208,Germany,North Rhine-Westphalia,Ruhr region,,,1,17.283333,2,,2,,,,70.349998,1,177.89999,1,,22.228605,,2,512.57141,1,3,5,sugar reduced,0,,,2016,22.228605
14449,27433,Germany,North Rhine-Westphalia,Ruhr region,,,1,5.5250001,1,,2,,,,19.15,1,115.4,1,,14.379943,,2,280.71429,1,3,5,sugar reduced,0,,,2015,14.379942
14449,27433,Germany,North Rhine-Westphalia,Ruhr region,,,1,8.2666664,1,,2,,,,27.6,1,136,1,,14.922145,,2,171.42857,1,3,5,sugar reduced,0,,,2017,14.922146
14939,49103,Germany,North Rhine-Westphalia,Ruhr region,,,2,1.0583333,1,,2,,,,9.3500004,1,73,1,,17.545506,,2,,,3,5,sugar reduced,0,,,2017,17.545506
14939,49103,Germany,North Rhine-Westphalia,Ruhr region,,,2,2.075,1,,2,,,,12.35,1,83.800003,1,,17.586479,,2,,,3,0,,0,,,2018,17.586479
18242,57676,Germany,North Rhine-Westphalia,Ruhr region,,,2,1.0166667,1,,2,,,,10.28,1,77,1,,17.338505,,2,,,3,5,sugar reduced,0,,,2019,17.338505
20215,56636,Germany,North Rhine-Westphalia,Ruhr region,,,1,11.15,1,,2,,,,29.35,1,144.5,1,,14.056345,,2,766.57141,2,3,5,sugar reduced,0,,,2015,14.056345
20215,56636,Germany,North Rhine-Westphalia,Ruhr region,,,1,12.208333,1,,2,,,,33.450001,1,149.39999,1,,14.986318,,2,214.28572,1,3,5,sugar reduced,0,,,2016,14.986319
20215,56636,Germany,North Rhine-Westphalia,Ruhr region,,,1,13.15,2,,2,,,,37.900002,1,160,1,,14.804688,,2,100.71429,1,3,5,sugar reduced,0,,,2017,14.804688
20215,56636,Germany,North Rhine-Westphalia,Ruhr region,,,1,14.225,2,,2,,,,44.349998,1,170.60001,1,,15.238267,,2,33.57143,1,3,5,sugar reduced,0,,,2018,15.238265
22829,46908,Germany,North Rhine-Westphalia,Ruhr region,,,2,17.15,2,,2,,,,66,1,169,1,,23.108435,,2,0,1,3,0,,0,,,2015,23.108435
22829,46908,Germany,North Rhine-Westphalia,Ruhr region,,,2,18.633333,2,,2,,,,69.400002,1,169.7,1,,24.09882,,2,36.857143,1,3,0,,0,,,2016,24.098822
24093,79963,Germany,North Rhine-Westphalia,Ruhr region,,,1,12.291667,1,,2,,,,34.25,1,149.10001,1,,15.406547,,2,1082.6428,2,3,,,,,,2015,15.406545
24093,79963,Germany,North Rhine-Westphalia,Ruhr region,,,1,13.425,2,,2,,,,37.349998,1,153.39999,1,,15.872301,,2,364.28571,1,3,0,,0,,,2016,15.872301
24093,79963,Germany,North Rhine-Westphalia,Ruhr region,,,1,14.383333,2,,2,,,,38.950001,1,157.89999,1,,15.622236,,2,200,1,3,5,sugar reduced,0,,,2017,15.622238
25995,76436,Germany,North Rhine-Westphalia,Ruhr region,,,2,1.0416666,1,,2,,,,9.0100002,1,75.5,1,,15.806324,,2,,,3,5,sugar reduced,0,,,2017,15.806325
26897,48084,Germany,North Rhine-Westphalia,Ruhr region,,,1,16.15,2,,2,,,,61.25,1,176,1,,19.773373,,2,351.75,1,3,,,,,,2015,19.773373
26897,48084,Germany,North Rhine-Westphalia,Ruhr region,,,1,17.233334,2,,2,,,,65.449997,1,176.8,1,,20.938478,,2,167.35715,1,3,5,sugar reduced,0,,,2016,20.938477
26897,48084,Germany,North Rhine-Westphalia,Ruhr region,,,1,18.708334,2,,2,,,,65.900002,1,177.60001,1,,20.892937,,2,174.42857,1,3,5,sugar reduced,0,,,2018,20.892937
28392,30655,Germany,North Rhine-Westphalia,Ruhr region,,,1,1.1083333,1,,2,,,,9.2299995,1,72.5,1,,17.560047,,2,,,3,5,sugar reduced,0,,,2018,17.560047
28392,30655,Germany,North Rhine-Westphalia,Ruhr region,,,1,2.4000001,1,,2,,,,11.85,1,84.5,1,,16.596058,,2,,,3,5,sugar reduced,6,allergy,,2019,16.596058
36120,22735,Germany,North Rhine-Westphalia,Ruhr region,,,1,10.216666,1,,2,,,,36.200001,1,137,1,,19.287123,,2,699.14288,2,3,,,,,,2015,19.287123
36120,22735,Germany,North Rhine-Westphalia,Ruhr region,,,1,11.141666,1,,2,,,,39.650002,1,141.7,1,,19.747108,,2,0,1,3,0,,0,,,2016,19.747108
36120,22735,Germany,North Rhine-Westphalia,Ruhr region,,,1,12.175,1,,2,,,,45.049999,1,146.2,1,,21.076576,,2,253.28572,1,3,5,sugar reduced,0,,,2017,21.076576
36120,22735,Germany,North Rhine-Westphalia,Ruhr region,,,1,13.108334,2,,2,,,,52,1,151.5,1,,22.655731,,2,415.5,1,3,5,sugar reduced,0,,,2018,22.655731
36120,22735,Germany,North Rhine-Westphalia,Ruhr region,,,1,14.208333,2,,2,,,,58.200001,1,160.2,1,,22.677645,,2,342.85715,1,3,0,,0,,,2019,22.677647
38628,37043,Germany,North Rhine-Westphalia,Ruhr region,,,2,4.1333332,1,,2,,,,19.299999,1,104.5,1,,17.673588,,2,390,1,3,,,,,,2015,17.673588
38628,37043,Germany,North Rhine-Westphalia,Ruhr region,,,2,5.1833334,1,,2,,,,22.1,1,114.2,1,,16.945721,,2,459,1,3,0,,0,,,2016,16.945723
38628,37043,Germany,North Rhine-Westphalia,Ruhr region,,,2,6.0583334,1,,2,,,,24.950001,1,121.7,1,,16.845713,,2,473.57144,1,3,0,,0,,,2017,16.845715
38628,37043,Germany,North Rhine-Westphalia,Ruhr region,,,2,7.0916667,1,,2,,,,28.85,1,129,1,,17.336699,,2,253.57143,1,3,0,,0,,,2018,17.336699
38628,37043,Germany,North Rhine-Westphalia,Ruhr region,,,2,8.1583338,1,,2,,,,33.400002,1,136.10001,1,,18.031431,,2,252.85715,1,3,0,,0,,,2019,18.031431
39707,37824,Germany,North Rhine-Westphalia,Ruhr region,,,2,.97500002,1,,2,,,,8.3000002,1,74.300003,1,,15.034897,,2,,,3,,,,,,2015,15.034897
39707,37824,Germany,North Rhine-Westphalia,Ruhr region,,,2,2.0666666,1,,2,,,,12.25,1,87.800003,1,,15.890847,,2,,,3,0,,0,,,2016,15.890846
39707,37824,Germany,North Rhine-Westphalia,Ruhr region,,,2,3.0583334,1,,2,,,,15.55,1,97.800003,1,,16.25746,,2,304.28571,1,3,0,,0,,,2017,16.25746
40979,52468,Germany,North Rhine-Westphalia,Ruhr region,,,1,12.166667,1,,2,,,,50.950001,1,163,1,,19.176483,,2,257.14285,1,3,,,,,,2015,19.176485
40979,52468,Germany,North Rhine-Westphalia,Ruhr region,,,1,13.2,2,,2,,,,50.799999,1,167.39999,1,,18.128122,,2,415.28571,1,3,5,sugar reduced,0,,,2016,18.128122
40979,52468,Germany,North Rhine-Westphalia,Ruhr region,,,1,14.25,2,,2,,,,52.849998,1,172.60001,1,,17.7404,,1,372.85715,1,3,5,sugar reduced,0,,,2017,17.740398
40979,52468,Germany,North Rhine-Westphalia,Ruhr region,,,1,15.2,2,,2,,,,61.900002,1,179.3,1,,19.254404,,2,411,1,3,0,,0,,,2018,19.254404
40979,52468,Germany,North Rhine-Westphalia,Ruhr region,,,1,16.275,2,,2,,,,69.199997,1,187,1,,19.788956,,2,433.14285,1,3,0,,0,,,2019,19.788956
41556,69719,Germany,North Rhine-Westphalia,Ruhr region,,,1,.98333335,1,,2,,,,10.55,1,76.699997,1,,17.933363,,2,,,3,,,,,,2015,17.933365
41556,69719,Germany,North Rhine-Westphalia,Ruhr region,,,1,1.9916667,1,,2,,,,13.1,1,87.300003,1,,17.188692,,2,,,3,0,,0,,,2016,17.18869
41556,69719,Germany,North Rhine-Westphalia,Ruhr region,,,1,4,1,,2,,,,17.75,1,105.6,1,,15.917341,,2,531.42859,1,3,0,,0,,,2018,15.917341
41556,69719,Germany,North Rhine-Westphalia,Ruhr region,,,1,5.0583334,1,,2,,,,20.200001,1,113,1,,15.819563,,2,323.57144,1,3,0,,0,,,2019,15.819564
42116,25542,Germany,North Rhine-Westphalia,Ruhr region,,,2,3.05,1,,2,,,,13.45,1,93.099998,1,,15.517542,,2,248.57143,1,3,5,sugar reduced,0,,,2015,15.517542
42116,25542,Germany,North Rhine-Westphalia,Ruhr region,,,2,4.1583333,1,,2,,,,15.25,1,101.8,1,,14.715475,,2,262.5,1,3,0,,0,,,2016,14.715474
42116,25542,Germany,North Rhine-Westphalia,Ruhr region,,,2,5.25,1,,2,,,,17.9,1,109.2,1,,15.010936,,2,172.92857,1,3,0,,0,,,2017,15.010936
42116,25542,Germany,North Rhine-Westphalia,Ruhr region,,,2,6.0416665,1,,2,,,,19.5,1,116,1,,14.491676,,2,756.42859,2,3,0,,0,,,2018,14.491676
42116,25542,Germany,North Rhine-Westphalia,Ruhr region,,,2,7.2166667,1,,2,,,,21.5,1,121.4,1,,14.588179,,2,434.57144,1,3,0,,0,,,2019,14.588179
43237,58896,Germany,North Rhine-Westphalia,Ruhr region,,,1,16.316668,2,,2,,,,58.75,1,180.10001,1,,18.112585,,2,331.60715,1,3,,,,,,2016,18.112585
43237,58896,Germany,North Rhine-Westphalia,Ruhr region,,,1,17.258333,2,,2,,,,58.450001,1,180.7,1,,17.900625,,2,73.928574,1,3,0,,0,,,2016,17.900627
43237,58896,Germany,North Rhine-Westphalia,Ruhr region,,,1,18.35,2,,2,,,,58.150002,1,181.10001,1,,17.730167,,2,0,1,3,0,,0,,,2018,17.730165
47163,55469,Germany,North Rhine-Westphalia,Ruhr region,,,2,1.0916667,1,,2,,,,10.28,1,72.199997,1,,19.720535,,2,,,3,5,sugar reduced,0,,,2018,19.720537
47163,55469,Germany,North Rhine-Westphalia,Ruhr region,,,2,2.0999999,1,,2,,,,13.6,1,85,1,,18.82353,,2,,,3,5,sugar reduced,0,,,2019,18.82353
48184,95671,Germany,North Rhine-Westphalia,Ruhr region,,,1,2.25,1,,2,,,,13.8,1,92.099998,1,,16.268961,,2,,,3,,,,,,2015,16.268963
48184,95671,Germany,North Rhine-Westphalia,Ruhr region,,,1,3.125,1,,2,,,,16.25,1,101.9,1,,15.649663,,2,384.71429,1,3,0,,0,,,2016,15.649663
48184,95671,Germany,North Rhine-Westphalia,Ruhr region,,,1,4.2083335,1,,2,,,,18.700001,1,110.3,1,,15.370591,,2,300,1,3,0,,0,,,2017,15.370591
48184,95671,Germany,North Rhine-Westphalia,Ruhr region,,,1,5.2833333,1,,2,,,,20.799999,1,117.6,1,,15.04003,,2,434.57144,1,3,0,,0,,,2018,15.04003
48184,95671,Germany,North Rhine-Westphalia,Ruhr region,,,1,6.3083334,1,,2,,,,23.950001,1,125.2,1,,15.279068,,2,336,1,3,0,,0,,,2019,15.279069
50539,69184,Germany,North Rhine-Westphalia,Ruhr region,,,1,2.0666666,1,,2,,,,13.05,1,85.400002,1,,17.893478,,2,,,3,,,,,,2015,17.893478
50539,69184,Germany,North Rhine-Westphalia,Ruhr region,,,1,3.175,1,,2,,,,15.65,1,94.599998,1,,17.487675,,2,364.28571,1,3,5,sugar reduced,0,,,2016,17.487675
50539,69184,Germany,North Rhine-Westphalia,Ruhr region,,,1,4.0500002,1,,2,,,,17.65,1,101.7,1,,17.064863,,2,618,2,3,5,sugar reduced,0,,,2017,17.064863
50539,69184,Germany,North Rhine-Westphalia,Ruhr region,,,1,5.0916667,1,,2,,,,19.35,1,109.6,1,,16.108677,,2,703.71429,2,3,5,sugar reduced,0,,,2018,16.108677
50539,69184,Germany,North Rhine-Westphalia,Ruhr region,,,1,6.3249998,1,,2,,,,21.799999,1,117,1,,15.925196,,2,896.57141,2,3,5,sugar reduced,0,,,2019,15.925195
50694,56079,Germany,North Rhine-Westphalia,Ruhr region,,,1,13.166667,2,,2,,,,44.849998,1,162,1,,17.089621,,2,296.85715,1,3,5,sugar reduced,0,,,2015,17.089621
50694,56079,Germany,North Rhine-Westphalia,Ruhr region,,,1,14.216666,2,,2,,,,54.950001,1,172.8,1,,18.402643,,2,425.14285,1,3,,,,,,2016,18.402643
50694,56079,Germany,North Rhine-Westphalia,Ruhr region,,,1,15.341666,2,,2,,,,61.349998,1,179.5,1,,19.040821,,2,489.42856,1,3,5,sugar reduced,0,,,2017,19.040821
50694,56079,Germany,North Rhine-Westphalia,Ruhr region,,,1,16.225,2,,2,,,,66.300003,1,181.60001,1,,20.103971,,2,516.85712,1,3,5,sugar reduced,0,,,2018,20.10397
50694,56079,Germany,North Rhine-Westphalia,Ruhr region,,,1,17.366667,2,,2,,,,65.900002,1,182.8,1,,19.721186,,2,675,2,3,5,sugar reduced,0,,,2019,19.721186
51685,26892,Germany,North Rhine-Westphalia,Ruhr region,,,2,10.166667,1,,2,,,,34.900002,1,142,1,,17.308073,,2,294.28571,1,3,,,,,,2015,17.308075
51685,26892,Germany,North Rhine-Westphalia,Ruhr region,,,2,11.183333,1,,2,,,,38.25,1,148.10001,1,,17.43899,,2,310.71429,1,3,5,sugar reduced,0,,,2016,17.438988
51685,26892,Germany,North Rhine-Westphalia,Ruhr region,,,2,12.1,2,,2,,,,44.5,1,155.2,1,,18.474665,,2,231.42857,1,3,5,sugar reduced,0,,,2017,18.474667
51835,33606,Germany,North Rhine-Westphalia,Ruhr region,,,1,1.1,1,,2,,,,10.3,1,81.199997,1,,15.621588,,2,,,3,5,sugar reduced,0,,,2016,15.621589
51835,33606,Germany,North Rhine-Westphalia,Ruhr region,,,1,2.0583334,1,,2,,,,13.75,1,93.599998,1,,15.694627,,2,,,3,0,,0,,,2017,15.694628
51835,33606,Germany,North Rhine-Westphalia,Ruhr region,,,1,3.2249999,1,,2,,,,16.6,1,103.7,1,,15.436562,,2,312.85715,1,3,0,,0,,,2018,15.436563
55290,52820,Germany,North Rhine-Westphalia,Ruhr region,,,1,.98333335,1,,2,,,,10.52,1,76.400002,1,,18.023081,,2,,,3,5,sugar reduced,0,,,2016,18.023081
55290,52820,Germany,North Rhine-Westphalia,Ruhr region,,,1,3.1666667,1,,2,,,,15.95,1,100.2,1,,15.886391,,2,706.71429,2,3,5,sugar reduced,0,,,2018,15.886392
57121,69577,Germany,North Rhine-Westphalia,Ruhr region,,,1,1.0083333,1,,2,,,,10.44,1,79,1,,16.728088,,2,,,3,,,,,,2015,16.728088
57121,69577,Germany,North Rhine-Westphalia,Ruhr region,,,1,2.1666667,1,,2,,,,13.1,1,90.099998,1,,16.136959,,2,,,3,0,,0,,,2016,16.136961
58814,69596,Germany,North Rhine-Westphalia,Ruhr region,,,1,12.175,1,,2,,,,42.900002,1,151.89999,1,,18.592669,,2,307.64285,1,3,,,,,,2015,18.592672
58814,69596,Germany,North Rhine-Westphalia,Ruhr region,,,1,13.116667,1,,2,,,,52.200001,1,162,1,,19.890261,,2,196.28572,1,3,0,,0,,,2016,19.890261
58814,69596,Germany,North Rhine-Westphalia,Ruhr region,,,1,14.25,2,,2,,,,55.349998,1,171.2,1,,18.884701,,1,214.28572,1,3,0,,0,,,2018,18.884701
58814,69596,Germany,North Rhine-Westphalia,Ruhr region,,,1,15.141666,2,,2,,,,61.799999,1,174,1,,20.412209,,2,85.714287,1,3,0,,0,,,2018,20.412207
58814,69596,Germany,North Rhine-Westphalia,Ruhr region,,,1,16.200001,2,,2,,,,65.599998,1,176.60001,1,,21.034027,,1,124.57143,1,3,0,,0,,,2019,21.034025
61215,45210,Germany,North Rhine-Westphalia,Ruhr region,,,1,15.208333,2,,2,,,,53.849998,1,172.5,1,,18.097038,,2,61.42857,1,3,0,,0,,,2015,18.097038
61215,45210,Germany,North Rhine-Westphalia,Ruhr region,,,1,16.299999,2,,2,,,,57.900002,1,180.7,1,,17.732185,,2,266.14285,1,3,0,,0,,,2016,17.732185
61215,45210,Germany,North Rhine-Westphalia,Ruhr region,,,1,17.383333,2,,2,,,,65.5,1,185.3,1,,19.076138,,2,141.42857,1,3,0,,0,,,2017,19.076138
61215,45210,Germany,North Rhine-Westphalia,Ruhr region,,,1,18.333334,2,,2,,,,70.300003,1,187.5,1,,19.996445,,2,177.42857,1,3,0,,0,,,2018,19.996445
62604,35552,Germany,North Rhine-Westphalia,Ruhr region,,,2,3.1083333,1,,2,,,,13.85,1,94.900002,1,,15.378619,,2,390,1,3,0,,0,,,2016,15.378619
62604,35552,Germany,North Rhine-Westphalia,Ruhr region,,,2,4.0833335,1,,2,,,,15.75,1,103.1,1,,14.817101,,2,334.28571,1,3,0,,0,,,2016,14.817101
62604,35552,Germany,North Rhine-Westphalia,Ruhr region,,,2,5.1999998,1,,2,,,,17.4,1,109.8,1,,14.4326,,2,131.14285,1,3,0,,0,,,2018,14.432599
62604,35552,Germany,North Rhine-Westphalia,Ruhr region,,,2,6.1666665,1,,2,,,,18.85,1,117,1,,13.770181,,2,223.57143,1,3,0,,0,,,2019,13.770181
62604,35552,Germany,North Rhine-Westphalia,Ruhr region,,,2,7.125,1,,2,,,,21.450001,1,122.5,1,,14.294044,,2,186.71428,1,3,0,,0,,,2019,14.294044
64071,66126,Germany,North Rhine-Westphalia,Ruhr region,,,1,1.1666666,1,,2,,,,9.8599997,1,72,1,,19.020061,,2,,,3,5,sugar reduced,0,,,2017,19.020061
65341,47946,Germany,North Rhine-Westphalia,Ruhr region,,,2,1.1416667,1,,2,,,,8.9700003,1,73,1,,16.832426,,2,,,3,0,,0,,,2019,16.832426
70981,47740,Germany,North Rhine-Westphalia,Ruhr region,,,1,2.0583334,1,,2,,,,15.5,1,92.199997,1,,18.233492,,2,,,3,,,,,,2015,18.233494
70981,47740,Germany,North Rhine-Westphalia,Ruhr region,,,1,3.075,1,,2,,,,17.75,1,104,1,,16.410873,,1,128.57143,1,3,5,sugar reduced,0,,,2016,16.410873
70981,47740,Germany,North Rhine-Westphalia,Ruhr region,,,1,4.4083333,1,,2,,,,20.85,1,113.8,1,,16.099838,,2,300,1,3,5,sugar reduced,0,,,2018,16.099838
70981,47740,Germany,North Rhine-Westphalia,Ruhr region,,,1,5.9916668,1,,2,,,,26.9,1,130.10001,1,,15.8927,,2,254.57143,1,3,5,sugar reduced,0,,,2019,15.892698
73080,17982,Germany,North Rhine-Westphalia,Ruhr region,,,1,7.1166668,1,,2,,,,22.549999,1,122.3,1,,15.076261,,2,1002.8214,2,3,0,,0,,,2015,15.07626
73080,17982,Germany,North Rhine-Westphalia,Ruhr region,,,1,8.125,1,,2,,,,24.65,1,127.2,1,,15.235008,,2,847.28571,2,3,0,,0,,,2016,15.235009
73080,17982,Germany,North Rhine-Westphalia,Ruhr region,,,1,9.3416662,1,,2,,,,28.35,1,131.7,1,,16.344872,,2,707.57141,2,3,0,,0,,,2017,16.344873
73080,17982,Germany,North Rhine-Westphalia,Ruhr region,,,1,11.633333,1,,2,,,,34.700001,1,142.39999,1,,17.112343,,2,730.28571,2,3,0,,0,,,2019,17.112345
73194,94332,Germany,North Rhine-Westphalia,Ruhr region,,,2,11.125,1,,2,,,,35.450001,1,148.89999,1,,15.989204,,2,738.85712,2,3,0,,0,,,2015,15.989205
73194,94332,Germany,North Rhine-Westphalia,Ruhr region,,,2,12.2,1,,2,,,,38.849998,1,153.89999,1,,16.402641,,2,471.42856,1,3,0,,0,,,2016,16.402641
73194,94332,Germany,North Rhine-Westphalia,Ruhr region,,,2,13.191667,2,,2,,,,42.799999,1,159.60001,1,,16.802658,,2,145.71428,1,3,0,,0,,,2017,16.802656
73194,94332,Germany,North Rhine-Westphalia,Ruhr region,,,2,14.225,2,,2,,,,48.150002,1,165.39999,1,,17.600512,,2,630.42859,2,3,0,,0,,,2018,17.600513
73194,94332,Germany,North Rhine-Westphalia,Ruhr region,,,2,15.25,2,,2,,,,51.25,1,169.3,1,,17.880512,,2,114,1,3,0,,0,,,2019,17.880512
73276,45173,Germany,North Rhine-Westphalia,Ruhr region,,,2,8.3166666,1,,2,,,,28.9,1,137.60001,1,,15.263741,,2,634.28571,2,3,,,,,,2015,15.263739
73276,45173,Germany,North Rhine-Westphalia,Ruhr region,,,2,10.325,1,,2,,,,34.549999,1,148.5,1,,15.667336,,2,505.71429,1,3,0,,0,,,2017,15.667336
73276,45173,Germany,North Rhine-Westphalia,Ruhr region,,,2,11.308333,1,,2,,,,41.450001,1,157.2,1,,16.773336,,2,477.85715,1,3,0,,0,,,2018,16.773336
73276,45173,Germany,North Rhine-Westphalia,Ruhr region,,,2,12.416667,1,,2,,,,46.349998,1,165,1,,17.024794,,2,308.57144,1,3,0,,0,,,2019,17.024794
74381,22647,Germany,North Rhine-Westphalia,Ruhr region,,,2,4.1166668,1,,2,,,,20.4,1,107.7,1,,17.587284,,2,160.71428,1,3,,,,,,2015,17.587284
74381,22647,Germany,North Rhine-Westphalia,Ruhr region,,,2,5.125,1,,2,,,,25.15,1,116.5,1,,18.530457,,2,260.71429,1,3,0,,0,,,2016,18.530457
74381,22647,Germany,North Rhine-Westphalia,Ruhr region,,,2,6.1583333,1,,2,,,,31.549999,1,126,1,,19.872765,,2,149.14285,1,3,0,,0,,,2017,19.872763
74977,69821,Germany,North Rhine-Westphalia,Ruhr region,,,2,1.0333333,1,,2,,,,9.1300001,1,73,1,,17.132669,,2,,,3,5,sugar reduced,0,,,2018,17.132671
74977,69821,Germany,North Rhine-Westphalia,Ruhr region,,,2,2.0833333,1,,2,,,,11.6,1,84.199997,1,,16.361902,,2,,,3,5,sugar reduced,0,,,2019,16.361904
76991,82827,Germany,North Rhine-Westphalia,Ruhr region,,,1,8.1333332,1,,2,,,,26.950001,1,123.8,1,,17.583992,,2,270,1,3,,,,,,2015,17.583992
76991,82827,Germany,North Rhine-Westphalia,Ruhr region,,,1,9.083333,1,,2,,,,29.6,1,128.39999,1,,17.954018,,2,692.57141,2,3,0,,0,,,2016,17.95402
76991,82827,Germany,North Rhine-Westphalia,Ruhr region,,,1,10.175,1,,2,,,,32.950001,1,133.39999,1,,18.515854,,2,261.42856,1,3,0,,0,,,2017,18.515856
76991,82827,Germany,North Rhine-Westphalia,Ruhr region,,,1,12.316667,1,,2,,,,42.950001,1,149.5,1,,19.216787,,2,304.28571,1,3,0,,0,,,2019,19.216787
77157,56808,Germany,North Rhine-Westphalia,Ruhr region,,,1,2.075,1,,2,,,,15.15,1,91.199997,1,,18.214739,,2,,,3,,,,,,2015,18.214741
77157,56808,Germany,North Rhine-Westphalia,Ruhr region,,,1,3.2249999,1,,2,,,,18.1,1,104,1,,16.734467,,2,705.71429,2,3,5,sugar reduced,0,,,2016,16.734468
77157,56808,Germany,North Rhine-Westphalia,Ruhr region,,,1,4.1583333,1,,2,,,,21.9,1,111.4,1,,17.647116,,2,420,1,3,5,sugar reduced,0,,,2017,17.647116
77157,56808,Germany,North Rhine-Westphalia,Ruhr region,,,1,5.1083331,1,,2,,,,25.35,1,118.3,1,,18.113754,,2,312.85715,1,3,5,sugar reduced,0,,,2018,18.113754
77157,56808,Germany,North Rhine-Westphalia,Ruhr region,,,1,5.8499999,1,,2,,,,27.35,1,124.3,1,,17.701704,,2,270,1,3,5,sugar reduced,0,,,2019,17.701704
79173,29395,Germany,North Rhine-Westphalia,Ruhr region,,,1,10.133333,1,,2,,,,39.700001,1,136.8,1,,21.213793,,2,282.85715,1,3,,,,,,2015,21.213791
79173,29395,Germany,North Rhine-Westphalia,Ruhr region,,,1,11.191667,1,,2,,,,45.349998,1,144,1,,21.870178,,2,124.28571,1,3,0,,0,,,2016,21.870176
79173,29395,Germany,North Rhine-Westphalia,Ruhr region,,,1,12.141666,1,,2,,,,49.400002,1,148,1,,22.552958,,2,169.71428,1,3,5,sugar reduced,0,,,2017,22.552959
79173,29395,Germany,North Rhine-Westphalia,Ruhr region,,,1,13.208333,2,,2,,,,48.950001,1,152,1,,21.186808,,1,502.5,1,3,5,sugar reduced,0,,,2018,21.186808
80813,24994,Germany,North Rhine-Westphalia,Ruhr region,,,1,.94166666,1,,2,,,,7.8699999,1,71.199997,1,,15.524397,,2,,,3,5,sugar reduced,0,,,2017,15.524398
80813,24994,Germany,North Rhine-Westphalia,Ruhr region,,,1,2.0166667,1,,2,,,,11.1,1,86,1,,15.008113,,2,,,3,5,sugar reduced,0,,,2018,15.008113
80813,24994,Germany,North Rhine-Westphalia,Ruhr region,,,1,3.125,1,,2,,,,14.2,1,99,1,,14.488317,,2,554.57141,1,3,0,,0,,,2019,14.488317
83355,35101,Germany,North Rhine-Westphalia,Ruhr region,,,2,18.291666,2,,2,,,,53.299999,1,164.89999,1,,19.601347,,2,74.571426,1,3,,,,,,2015,19.601347
85423,20724,Germany,North Rhine-Westphalia,Ruhr region,,,2,5.1750002,1,,2,,,,17.15,1,102.4,1,,16.355515,,2,364.14285,1,3,5,sugar reduced,0,,,2015,16.355515
85423,20724,Germany,North Rhine-Westphalia,Ruhr region,,,2,6.125,1,,2,,,,19.049999,1,109.1,1,,16.004623,,2,371.71429,1,3,1,,0,,,2016,16.004623
85423,20724,Germany,North Rhine-Westphalia,Ruhr region,,,2,7.3333335,1,,2,,,,21.15,1,116,1,,15.717896,,2,437.85715,1,3,5,sugar reduced,0,,,2017,15.717896
85423,20724,Germany,North Rhine-Westphalia,Ruhr region,,,2,8.0583334,1,,2,,,,23.549999,1,122,1,,15.82236,,2,654,2,3,1,,0,,,2018,15.822359
85423,20724,Germany,North Rhine-Westphalia,Ruhr region,,,2,9.2166662,1,,2,,,,26.6,1,126.5,1,,16.622662,,2,209.14285,1,3,5,sugar reduced,0,,,2019,16.622663
87962,18094,Germany,North Rhine-Westphalia,Ruhr region,,,1,5.0999999,1,,2,,,,16.4,1,104.2,1,,15.104571,,2,475.71429,1,3,5,sugar reduced,0,,,2015,15.104572
87962,18094,Germany,North Rhine-Westphalia,Ruhr region,,,1,6.1916666,1,,2,,,,17.4,1,111.3,1,,14.046203,,2,312.85715,1,3,,,,,,2016,14.046202
87962,18094,Germany,North Rhine-Westphalia,Ruhr region,,,1,7.1999998,1,,2,,,,19.549999,1,116.6,1,,14.379695,,2,405.42856,1,3,5,sugar reduced,0,,,2017,14.379694
87962,18094,Germany,North Rhine-Westphalia,Ruhr region,,,1,8.2333336,1,,2,,,,22,1,123.4,1,,14.447489,,2,351.42856,1,3,5,sugar reduced,0,,,2018,14.447488
87962,18094,Germany,North Rhine-Westphalia,Ruhr region,,,1,9.2250004,1,,2,,,,24.1,1,128.5,1,,14.595224,,2,480,1,3,5,sugar reduced,6,allergy,,2019,14.595225
88864,89995,Germany,North Rhine-Westphalia,Ruhr region,,,2,18.516666,2,,2,,,,65.900002,1,173.7,1,,21.841667,,2,223.71428,1,3,,,,,,2015,21.841667
90961,81688,Germany,North Rhine-Westphalia,Ruhr region,,,2,8.0333338,1,,2,,,,26.6,1,127.5,1,,16.362938,,2,386.78571,1,3,,,,,,2015,16.362938
90961,81688,Germany,North Rhine-Westphalia,Ruhr region,,,2,9.1416664,1,,2,,,,30.049999,1,135.39999,1,,16.391064,,2,733.07141,2,3,0,,0,,,2016,16.391066
90961,81688,Germany,North Rhine-Westphalia,Ruhr region,,,2,10.158334,1,,2,,,,32.75,1,142.3,1,,16.173407,,2,349.28571,1,3,0,,0,,,2017,16.173407
90961,81688,Germany,North Rhine-Westphalia,Ruhr region,,,2,11.208333,1,,2,,,,37.450001,1,150.10001,1,,16.622274,,2,180.71428,1,3,0,,0,,,2018,16.622272
98163,57530,Germany,North Rhine-Westphalia,Ruhr region,,,1,5.2583332,1,,2,,,,17.4,1,110.2,1,,14.328016,,1,347.14285,1,3,0,,0,,,2016,14.328016
98163,57530,Germany,North Rhine-Westphalia,Ruhr region,,,1,7.2166667,1,,2,,,,21.15,1,123.8,1,,13.799682,,2,445.71429,1,3,0,,0,,,2018,13.799682
98163,57530,Germany,North Rhine-Westphalia,Ruhr region,,,1,8.25,1,,2,,,,24.299999,1,129.60001,1,,14.467592,,2,597.85712,1,3,0,,0,,,2019,14.46759
103232,24803,Germany,North Rhine-Westphalia,Ruhr region,,,2,1.05,1,,2,,,,10.1,1,78.099998,1,,16.558435,,2,,,3,,,,,,2015,16.558437
104816,85290,Germany,North Rhine-Westphalia,Ruhr region,,,1,11.191667,1,,2,,,,37.349998,1,141.8,1,,18.575399,,2,257.14285,1,3,0,,0,,,2015,18.575397