id,hh_id,country,sec_area,tert_area,round,smpl_weight,sex,age,edc_level,edc,residence,preg_lact,breastfeeding,hh_head,wgt,wgt_method,hgt,hgt_method,bmi_adults,bmi_children,bmi_cat,misrep,pa,pa_cat,smoke,special_diet,special_diet_other,clin_diet,clin_diet_other,note,edc_hh,bmi_chld,bmi_zscore,ethnicity,pa_min_week
1,,Brazil,Rio de Janeiro,RIO DE JANEIRO,1,73.68050964085828,2,16,,,2,0,,,52.09999847412109,1,159.6000061035156,1,,,3,3,,,4,,,,,,,.0020453702,-.14,1,455
3,,Brazil,Paraiba,JOAO PESSOA,1,20.36676435261457,2,12,,,2,0,,,44.90000152587891,1,151.3500061035156,1,,,3,3,,,4,,,,,,,.0019601146,.4,1,0
4,,Brazil,Amapa,MACAPA,1,20.05280845381836,2,16,,,2,0,,,41.25,1,156,1,,,3,3,,,4,,,,,,,.0016950198,-1.61,2,210
5,,Brazil,Paraiba,JOAO PESSOA,1,46.60695918350984,1,13,,,2,0,,,33.20000076293945,1,142.8500061035156,1,,,3,3,,,4,,,,,,1,.0016269626,-1.09,2,180
6,,Brazil,Mato Grosso,CUIABA,1,61.86555634997679,2,15,,,2,0,,,40.45000076293945,1,148,1,,,3,3,,,4,,,,,,2,.0018466947,-.72,2,
7,,Brazil,Rio Grande do Sul,ALVORADA,1,100.4228328590273,2,13,,,2,0,,,43.84999847412109,1,156.3500061035156,1,,,3,2,,,4,,,,,,3,.001793799,-.52,1,0
8,,Brazil,Rio de Janeiro,RIO DE JANEIRO,1,1303.787447218453,1,12,,,2,0,,,44.75,1,153.5,1,,,3,1,,,4,,,,,,,.0018992244,.39,1,120
9,,Brazil,Santa Catarina,SAO JOSE,1,111.5944725062364,2,12,,,2,0,,,41.09999847412109,1,156.5500030517578,1,,,3,2,,,4,,,,,,2,.00167701,-.8300000000000001,1,420
10,,Brazil,Sao Paulo,SAO PAULO,1,410.4829250521525,1,12,,,2,0,,,35.40000152587891,1,153.3500061035156,1,,,3,2,,,4,,,,,,,.0015053437,-1.77,2,1260
11,,Brazil,Ceara,CAUCAIA,1,81.88606609533564,2,13,,,2,0,,,48.15000152587891,1,155.25,1,,,3,3,,,4,,,,,,,.001997713,.41,2,0
12,,Brazil,Rio de Janeiro,MESQUITA,1,546.4175587730642,2,15,,,2,0,,,47.5,1,160.3000030517578,1,,,3,2,,,4,,,,,,3,.0018485301,-.71,2,450
13,,Brazil,Goias,RIO VERDE,1,720.9354412941113,2,16,,,2,0,,,38.29999923706055,1,150.25,1,,,3,3,,,4,,,,,,1,.0016965623,-1.58,2,0
14,,Brazil,Piaui,TERESINA,1,19.45767666294121,2,14,,,2,0,,,41.65000152587891,1,158.8000030517578,1,,,3,2,,,4,,,,,,3,.0016516347,-1.4,2,90
16,,Brazil,Para,BELEM,1,128.5978550904298,1,12,,,2,0,,,34.90000152587891,1,147.8000030517578,1,,,3,2,,,4,,,,,,3,.0015976313,-1.18,1,
17,,Brazil,Sergipe,ARACAJU,1,33.98278494900973,2,15,,,2,0,,,39.45000076293945,1,154.3000030517578,1,,,3,3,,,4,,,,,,2,.0016569719,-1.7,2,0
18,,Brazil,Sergipe,ARACAJU,1,49.57735388006383,2,13,,,2,0,,,32.5,1,144.6499938964844,1,,,3,3,,,4,,,,,,1,.0015532684,-1.7,2,550
19,,Brazil,Rio de Janeiro,RIO DE JANEIRO,1,1022.866404492646,1,12,,,2,0,,,32.09999847412109,1,146.8999938964844,1,,,3,2,,,4,,,,,,,.0014875154,-1.75,2,1125
21,,Brazil,Alagoas,MACEIO,1,41.27284025095817,2,15,,,2,0,,,53,1,162.3000030517578,1,,,3,1,,,4,,,,,,3,.0020120502,-.1,2,600
22,,Brazil,Rio de Janeiro,RIO DE JANEIRO,1,102.922420681276,2,13,,,2,0,,,44.09999847412109,1,155.5,1,,,3,1,,,4,,,,,,2,.0018238024,-.28,2,1920
23,,Brazil,Piaui,TERESINA,1,65.72101959192233,2,16,,,2,0,,,40.5,1,159.5,1,,,2,2,,,4,,,,,,1,.0015919654,-2.15,2,0
25,,Brazil,Acre,RIO BRANCO,1,12.02865868546113,2,15,,,2,0,,,42.40000152587891,1,147.8000030517578,1,,,3,2,,,4,,,,,,,.0019409618,-.45,1,0
26,,Brazil,Espirito Santo,VITORIA,1,58.08223248644381,2,12,,,2,0,,,37.70000076293945,1,155.3999938964844,1,,,3,1,,,4,,,,,,,.0015611311,-1.48,2,1050
27,,Brazil,Rio de Janeiro,BELFORD ROXO,1,446.5391080196708,1,12,,,2,0,,,31.39999961853027,1,144.8000030517578,1,,,3,2,,,4,,,,,,,.0014975885,-1.9,2,0
30,,Brazil,Sao Paulo,SAO PAULO,1,167.6682183700928,2,13,,,2,0,,,35.95000076293945,1,154.75,1,,,2,2,,,4,,,,,,3,.0015011966,-2.26,2,0
31,,Brazil,Maranhao,SAO LUIS,1,15.8893141089762,2,14,,,2,0,,,43.20000076293945,1,161.5,1,,,3,2,,,4,,,,,,,.0016562989,-1.51,1,1020
32,,Brazil,Acre,RIO BRANCO,1,19.23362213136226,2,14,,,2,0,,,43.29999923706055,1,158.1000061035156,1,,,3,3,,,4,,,,,,,.001732304,-1.16,1,150
33,,Brazil,Acre,RIO BRANCO,1,18.52010683711918,2,12,,,2,0,,,25.5,1,135.5500030517578,1,,,2,2,,,4,,,,,,,.0013878455,-2.62,1,850
34,,Brazil,Rio de Janeiro,DUQUE DE CAXIAS,1,213.0392277965279,2,13,,,2,0,,,33.45000076293945,1,147.8999938964844,1,,,3,3,,,4,,,,,,,.0015291843,-1.94,2,30
35,,Brazil,Para,ANANINDEUA,1,84.91033818419214,1,13,,,2,0,,,31.85000038146973,1,146.1999969482422,1,,,2,2,,,4,,,,,,,.0014900976,-2.13,1,150
36,,Brazil,Parana,ARAUCARIA,1,241.8180464895027,2,12,,,2,0,,,31.39999961853027,1,145.6000061035156,1,,,3,3,,,4,,,,,,1,.0014811767,-1.8,2,135
37,,Brazil,Tocantins,PALMAS,1,26.10813519006836,2,15,,,2,0,,,43.84999847412109,1,154,1,,,3,1,,,1,,,,,,,.0018489626,-.84,4,25
39,,Brazil,Paraiba,JOAO PESSOA,1,75.32266055981452,1,13,,,2,0,,,34.15000152587891,1,146.3999938964844,1,,,3,3,,,4,,,,,,3,.0015933405,-1.31,1,465
40,,Brazil,Alagoas,MACEIO,1,36.93702719110709,1,14,,,2,0,,,49.84999847412109,1,171.9499969482422,1,,,3,2,,,4,,,,,,,.0016860126,-1.33,2,300
42,,Brazil,Pernambuco,JABOATAO DOS GUARARAPES,1,23.30401790344904,2,13,,,2,0,,,39.04999923706055,1,159.6499938964844,1,,,3,3,,,4,,,,,,,.0015320863,-1.87,2,605
43,,Brazil,Mato Grosso,CUIABA,1,29.76005245418949,2,17,,,2,0,,,52.84999847412109,1,154.6000061035156,1,,,3,1,,,4,,,,,,3,.0022111896,.33,2,
45,,Brazil,Minas Gerais,BELO HORIZONTE,1,56.41155677917051,2,12,,,2,0,,,40.84999847412109,1,145.6000061035156,1,,,3,1,,,4,,,,,,,.0019269447,.23,1,1650
46,,Brazil,Pernambuco,JABOATAO DOS GUARARAPES,1,1062.391841595362,2,12,,,2,0,,,26.35000038146973,1,145.8500061035156,1,,,1,3,,,4,,,,,,,.0012387045,-3.72,2,82
47,,Brazil,Parana,CURITIBA,1,72.88783801572741,1,12,,,2,0,,,37.70000076293945,1,149.3999938964844,1,,,3,3,,,4,,,,,,,.001689041,-.66,2,0
48,,Brazil,Espirito Santo,SERRA,1,1270.4393931646,2,12,,,2,0,,,32.34999847412109,1,143.4499969482422,1,,,3,3,,,4,,,,,,3,.0015720747,-1.13,2,1665
50,,Brazil,Pernambuco,JABOATAO DOS GUARARAPES,1,173.0546291025312,2,12,,,2,0,,,40.20000076293945,1,143.8500061035156,1,,,3,3,,,4,,,,,,1,.0019427025,.26,2,180
51,,Brazil,Paraiba,JOAO PESSOA,1,64.26424370677282,2,17,,,2,0,,,43.20000076293945,1,154.8000030517578,1,,,3,3,,,4,,,,,,3,.0018027762,-1.17,1,0
52,,Brazil,Parana,PINHAIS,1,100.5013461737706,1,16,,,2,0,,,46.34999847412109,1,154.75,1,,,3,3,,,4,,,,,,,.0019354788,-.65,2,
53,,Brazil,Sao Paulo,SAO PAULO,1,60.33710538847434,2,16,,,2,0,,,53.65000152587891,1,165.1000061035156,1,,,3,1,,,4,,,,,,3,.0019682287,-.48,2,500
54,,Brazil,Santa Catarina,SAO JOSE,1,91.68311968104697,1,13,,,2,0,,,40.95000076293945,1,159.75,1,,,3,2,,,4,,,,,,,.0016046199,-1.46,1,480
55,,Brazil,Mato Grosso do Su,CAMPO GRANDE,1,203.9541890646718,1,12,,,2,0,,,31.39999961853027,1,148.1000061035156,1,,,2,2,,,4,,,,,,3,.0014315927,-2.31,1,1650
57,,Brazil,Parana,CURITIBA,1,31.57102298556955,2,13,,,2,0,,,36.45000076293945,1,147.75,1,,,3,3,,,4,,,,,,2,.0016697159,-1.04,2,
58,,Brazil,Rio de Janeiro,RIO DE JANEIRO,1,342.1733025329866,2,12,,,2,0,,,40.04999923706055,1,165.5,1,,,2,2,,,4,,,,,,3,.0014621991,-2.16,2,120
59,,Brazil,Rio Grande do Sul,PORTO ALEGRE,1,136.9475142568472,1,13,,,2,0,,,59.90000152587891,1,167.75,1,,,3,1,,,4,,,,,,3,.0021286379,1,2,900
60,,Brazil,Goias,TRINDADE,1,94.34875171980235,2,12,,,2,0,,,46.15000152587891,1,159.8999938964844,1,,,3,3,,,4,,,,,,,.0018049901,-.15,2,10
61,,Brazil,Sao Paulo,SAO PAULO,1,278.2671759153638,1,13,,,2,0,,,39.5,1,149.3500061035156,1,,,3,1,,,4,,,,,,,.0017708697,-.58,5,0
62,,Brazil,Acre,RIO BRANCO,1,15.34311541178796,1,13,,,2,0,,,31.60000038146973,1,145.1999969482422,1,,,3,1,,,4,,,,,,,.0014988352,-1.96,2,330
63,,Brazil,Distrito Federal,BRASILIA,1,59.31536442844298,1,15,,,2,0,,,42.59999847412109,1,158.5,1,,,3,2,,,4,,,,,,,.0016957079,-1.61,1,
65,,Brazil,Rio de Janeiro,RIO DE JANEIRO,1,254.9011806122745,1,13,,,2,0,,,37.90000152587891,1,155.1999969482422,1,,,3,3,,,4,,,,,,2,.0015734604,-1.58,2,1170
66,,Brazil,Parana,SAO JOSE DOS PINHAIS,1,40.71696424520898,2,14,,,2,0,,,50.84999847412109,1,162.1999969482422,1,,,3,3,,,4,,,,,,,.0019328104,-.18,1,0
67,,Brazil,Espirito Santo,VILA VELHA,1,94.57870895050196,2,15,,,2,0,,,45,1,157.5500030517578,1,,,3,2,,,4,,,,,,,.0018129076,-.87,1,270
70,,Brazil,Paraiba,JOAO PESSOA,1,43.67468941002922,2,12,,,2,0,,,30.89999961853027,1,146.5,1,,,2,3,,,4,,,,,,2,.0014397372,-2.16,1,0
71,,Brazil,Maranhao,SAO LUIS,1,35.48248307689462,2,13,,,2,0,,,44.25,1,148.3000030517578,1,,,3,3,,,4,,,,,,,.0020120137,.43,1,0
72,,Brazil,Rio Grande do Sul,PORTO ALEGRE,1,118.9046327991269,1,13,,,2,0,,,37.5,1,151.3999938964844,1,,,3,1,,,4,,,,,,,.0016359859,-1.07,1,195
73,,Brazil,Sao Paulo,GUARULHOS,1,1575.485313230843,1,12,,,2,0,,,33.95000076293945,1,155,1,,,2,2,,,4,,,,,,3,.0014131113,-2.55,2,0
75,,Brazil,Sao Paulo,SAO PAULO,1,248.8800537260198,2,14,,,2,0,,,35.29999923706055,1,145,1,,,3,3,,,4,,,,,,2,.0016789536,-1.3,2,90
76,,Brazil,Acre,RIO BRANCO,1,44.46708666125296,2,12,,,2,0,,,22.10000038146973,1,147.5,1,,,1,1,,,4,,,,,,,.0010158001,-5.46,2,200
78,,Brazil,Sao Paulo,SAO VICENTE,1,1627.164882128903,2,13,,,2,0,,,36.34999847412109,1,147.1499938964844,1,,,3,2,,,4,,,,,,3,.0016787418,-.9400000000000001,2,
79,,Brazil,Sergipe,ARACAJU,1,50.99266740096542,2,16,,,2,0,,,40.34999847412109,1,163.8999938964844,1,,,2,3,,,4,,,,,,,.0015020544,-2.78,2,300
80,,Brazil,Para,BELEM,1,65.2921486418869,2,15,,,2,0,,,38.5,1,157.6999969482422,1,,,2,3,,,1,,,,,,2,.0015480941,-2.35,1,2035
82,,Brazil,Maranhao,SAO LUIS,1,112.052840778322,1,12,,,2,0,,,32,1,138.5,1,,,3,2,,,4,,,,,,,.0016682089,-.59,1,900
84,,Brazil,Para,BELEM,1,128.557300736885,1,12,,,2,0,,,38.59999847412109,1,150.5,1,,,3,3,,,4,,,,,,1,.0017041754,-.42,2,225
85,,Brazil,Rio Grande do Sul,PORTO ALEGRE,1,122.1085817660943,2,12,,,2,0,,,38.75,1,151.8999938964844,1,,,3,1,,,4,,,,,,,.0016794079,-.85,1,0
87,,Brazil,Acre,RIO BRANCO,1,49.32350811827035,1,13,,,2,0,,,30.5,1,138.1999969482422,1,,,3,2,,,4,,,,,,3,.0015969223,-1.58,2,340
88,,Brazil,Minas Gerais,VESPASIANO,1,128.2284622280498,2,17,,,2,0,,,56.15000152587891,1,164.3000030517578,1,,,3,2,,,4,,,,,,3,.002080054,-.09,2,255
89,,Brazil,Rio de Janeiro,MESQUITA,1,189.0100850985674,1,12,,,2,0,,,40.45000076293945,1,164.5,1,,,3,2,,,4,,,,,,,.0014948125,-1.82,1,210
90,,Brazil,Parana,PINHAIS,1,150.1548007986264,2,12,,,2,0,,,32.65000152587891,1,145.1999969482422,1,,,3,3,,,4,,,,,,2,.0015486383,-1.61,1,840
91,,Brazil,Alagoas,MACEIO,1,48.30488516330374,2,12,,,2,0,,,28.20000076293945,1,135.75,1,,,3,1,,,4,,,,,,1,.0015302749,-1.42,1,0
92,,Brazil,Rio Grande do Nor,MOSSORO,1,498.8714393424685,2,12,,,2,0,,,35.75,1,147.3999938964844,1,,,3,2,,,4,,,,,,,.0016454365,-.76,1,180
95,,Brazil,Amapa,MACAPA,1,21.0438280079315,1,15,,,2,0,,,60.54999923706055,1,162.5,1,,,3,1,,,4,,,,,,1,.0022930177,.9500000000000001,1,720
96,,Brazil,Espirito Santo,VITORIA,1,68.69340957531335,2,12,,,2,0,,,40.34999847412109,1,157.6499938964844,1,,,3,2,,,4,,,,,,,.0016235124,-1.03,2,120
98,,Brazil,Amapa,MACAPA,1,11.6732604285589,2,12,,,2,0,,,39.75,1,154.1000061035156,1,,,3,3,,,4,,,,,,,.0016739089,-.91,1,105
99,,Brazil,Espirito Santo,VITORIA,1,26.67025956890183,2,14,,,2,0,,,50.15000152587891,1,165.0500030517578,1,,,3,2,,,4,,,,,,3,.001840941,-.46,1,210
100,,Brazil,Amapa,MACAPA,1,53.12525979247783,2,13,,,2,0,,,36.40000152587891,1,148,1,,,3,1,,,4,,,,,,,.0016617971,-1.27,2,180
101,,Brazil,Acre,RIO BRANCO,1,48.96103279071971,1,13,,,1,0,,,32.90000152587891,1,141.6999969482422,1,,,3,2,,,4,,,,,,,.0016385369,-1.21,2,1260
103,,Brazil,Piaui,TERESINA,1,125.3044268459795,2,12,,,2,0,,,34.70000076293945,1,150.6000061035156,1,,,3,2,,,4,,,,,,,.001529958,-1.64,1,1110
104,,Brazil,Minas Gerais,SETE LAGOAS,1,439.1649817016826,1,14,,,2,0,,,38.79999923706055,1,159,1,,,2,3,,,4,,,,,,3,.0015347494,-2.36,1,1170
105,,Brazil,Maranhao,SAO LUIS,1,27.68375457558276,2,14,,,1,0,,,44.84999847412109,1,152.9499969482422,1,,,3,2,,,4,,,,,,,.0019171826,-.15,2,605
106,,Brazil,Paraiba,JOAO PESSOA,1,8.174157497550627,2,15,,,2,0,,,39.95000076293945,1,151.6499938964844,1,,,3,2,,,4,,,,,,2,.0017371287,-1.32,2,210
107,,Brazil,Alagoas,MACEIO,1,88.45860355801362,2,14,,,2,0,,,37.70000076293945,1,152.5500030517578,1,,,3,2,,,4,,,,,,,.0016200071,-1.64,2,
108,,Brazil,Paraiba,JOAO PESSOA,1,18.45269614860489,2,12,,,2,0,,,33,1,144.9499969482422,1,,,3,3,,,4,,,,,,,.0015706432,-1.14,2,60
109,,Brazil,Espirito Santo,VITORIA,1,26.38619598942021,2,14,,,2,0,,,48.34999847412109,1,164.1999969482422,1,,,3,2,,,4,,,,,,3,.0017932885,-.74,1,1250
110,,Brazil,Mato Grosso,VARZEA GRANDE,1,7.146257587850171,2,16,,,2,0,,,38.90000152587891,1,154.3999938964844,1,,,3,3,,,4,,,,,,3,.0016317554,-1.96,2,0
111,,Brazil,Tocantins,PALMAS,1,14.68442252457574,2,17,,,2,0,,,47.84999847412109,1,162.25,1,,,3,3,,,4,,,,,,3,.0018176595,-1.12,2,240
112,,Brazil,Sergipe,ARACAJU,1,22.38460684933393,1,13,,,2,0,,,37.15000152587891,1,150.1000061035156,1,,,3,3,,,4,,,,,,1,.0016489117,-1.28,2,
113,,Brazil,Pernambuco,RECIFE,1,19.64176469908857,2,13,,,2,0,,,31.54999923706055,1,149.1000061035156,1,,,2,2,,,4,,,,,,,.0014192014,-2.62,2,0
114,,Brazil,Sao Paulo,SAO PAULO,1,167.0510663000288,2,16,,,2,0,,,44.59999847412109,1,155,1,,,3,2,,,1,,,,,,,.0018563995,-.84,1,
115,,Brazil,Tocantins,PALMAS,1,36.27102777116897,2,17,,,2,0,,,42.34999847412109,1,151.9499969482422,1,,,3,3,,,4,,,,,,,.0018342225,-1.09,2,350
116,,Brazil,Amazonas,MANAUS,1,19.2600547799237,2,17,,,2,0,,,38.34999847412109,1,159.8999938964844,1,,,2,2,,,4,,,,,,3,.0014999212,-2.81,2,1665
117,,Brazil,Tocantins,PALMAS,1,26.36467802903306,2,12,,,2,0,,,38.34999847412109,1,150.3000030517578,1,,,3,3,,,4,,,,,,1,.0016976469,-.7000000000000001,2,3
118,,Brazil,Para,BELEM,1,65.2921486418869,2,15,,,2,0,,,31.54999923706055,1,152.6999969482422,1,,,1,3,,,4,,,,,,,.0013530732,-3.6,2,0
119,,Brazil,Pernambuco,RECIFE,1,83.05905999666253,2,14,,,2,0,,,35.29999923706055,1,152.0500030517578,1,,,2,3,,,4,,,,,,,.0015268691,-2.23,2,0
120,,Brazil,Sao Paulo,GUARULHOS,1,306.735730940062,2,13,,,2,0,,,49.79999923706055,1,162.8999938964844,1,,,3,1,,,4,,,,,,2,.0018766669,-.04,2,390
121,,Brazil,Rio de Janeiro,DUQUE DE CAXIAS,1,371.1832971025745,1,16,,,2,0,,,59,1,172.8999938964844,1,,,3,3,,,4,,,,,,,.0019736132,-.46,1,420
123,,Brazil,Distrito Federal,BRASILIA,1,85.05252696538102,2,16,,,2,0,,,48.70000076293945,1,153.75,1,,,3,1,,,4,,,,,,2,.0020601493,-.05,2,525
124,,Brazil,Alagoas,MACEIO,1,48.30488516330374,2,12,,,2,0,,,36.5,1,147.0500030517578,1,,,3,2,,,4,,,,,,,.0016879624,-.54,1,60
125,,Brazil,Paraiba,JOAO PESSOA,1,58.73569950143943,1,15,,,2,0,,,41.84999847412109,1,154.1000061035156,1,,,3,1,,,4,,,,,,,.0017623418,-1.04,,720
126,,Brazil,Para,ANANINDEUA,1,206.6979191326703,2,12,,,2,0,,,34.15000152587891,1,153.3999938964844,1,,,2,1,,,4,,,,,,3,.0014512427,-2.04,1,75
128,,Brazil,Pernambuco,CAMARAGIBE,1,50.13026862586788,1,13,,,2,0,,,41.40000152587891,1,148.6000061035156,1,,,3,2,,,4,,,,,,,.0018748335,.09,4,120
129,,Brazil,Goias,APARECIDA DE GOIANIA,1,25.52392682867825,2,16,,,2,0,,,45.95000076293945,1,161.5,1,,,3,1,,,4,,,,,,3,.0017617345,-1.28,1,180
130,,Brazil,Espirito Santo,VITORIA,1,20.99959060464128,1,13,,,2,0,,,37.54999923706055,1,146.8500061035156,1,,,3,2,,,4,,,,,,,.0017412534,-.43,2,
132,,Brazil,Minas Gerais,BELO HORIZONTE,1,17.07473634731356,2,14,,,2,0,,,39.79999923706055,1,149,1,,,3,3,,,4,,,,,,,.001792712,-.8100000000000001,2,0
133,,Brazil,Sergipe,ARACAJU,1,90.57438778924245,1,12,,,2,0,,,32.95000076293945,1,144,1,,,3,3,,,4,,,,,,1,.001589024,-1.18,1,30
134,,Brazil,Para,ANANINDEUA,1,17.46709687551538,2,16,,,2,0,,,55.29999923706055,1,157.1000061035156,1,,,3,1,,,4,,,,,,3,.0022406434,.5,1,600
135,,Brazil,Piaui,TERESINA,1,32.87109467029213,2,15,,,2,0,,,47.65000152587891,1,169.25,1,,,3,3,,,4,,,,,,,.001663434,-1.71,2,0
137,,Brazil,Minas Gerais,BELO HORIZONTE,1,117.8984746022427,2,14,,,2,0,,,47.59999847412109,1,162.1499938964844,1,,,3,3,,,4,,,,,,,.0018103939,-.8300000000000001,2,0
138,,Brazil,Espirito Santo,VITORIA,1,47.45143887526886,2,12,,,2,0,,,33.95000076293945,1,137.3999938964844,1,,,3,2,,,4,,,,,,2,.0017983174,-.12,1,50
139,,Brazil,Espirito Santo,VITORIA,1,13.29358892215433,1,15,,,2,0,,,51.29999923706055,1,169.1499938964844,1,,,3,3,,,4,,,,,,,.0017929715,-.91,,0
141,,Brazil,Pernambuco,RECIFE,1,46.6140412923633,2,16,,,2,0,,,43.54999923706055,1,161.1000061035156,1,,,3,1,,,4,,,,,,3,.0016780196,-1.72,1,440
142,,Brazil,Piaui,TERESINA,1,53.29433038126776,1,12,,,2,0,,,36.40000152587891,1,147.1499938964844,1,,,3,2,,,4,,,,,,,.0016810511,-.52,4,270
143,,Brazil,Amapa,MACAPA,1,56.63847220496097,2,14,,,2,0,,,44.70000076293945,1,156.6999969482422,1,,,3,1,,,4,,,,,,3,.0018204114,-.66,1,1080
145,,Brazil,Amazonas,MANAUS,1,55.02518969536445,2,12,,,2,0,,,39.79999923706055,1,146.8999938964844,1,,,3,2,,,4,,,,,,1,.0018443337,.02,2,220
146,,Brazil,Rondonia,PORTO VELHO,1,11.5470964215707,2,15,,,2,0,,,52.75,1,161.1999969482422,1,,,3,1,,,4,,,,,,3,.0020299831,-.09,1,60
147,,Brazil,Rio Grande do Sul,PORTO ALEGRE,1,79.61991211434199,1,13,,,2,0,,,50.20000076293945,1,165.1000061035156,1,,,3,1,,,4,,,,,,,.0018416604,-.15,1,1080
148,,Brazil,Distrito Federal,BRASILIA,1,212.4194634095522,2,12,,,2,0,,,29.5,1,141.25,1,,,2,2,,,4,,,,,,,.001478581,-2.04,2,295
150,,Brazil,Rio Grande do Sul,PORTO ALEGRE,1,44.15724238584295,1,13,,,2,0,,,35.29000091552734,1,145,1,,,3,2,,,4,,,,,,1,.0016784781,-.9400000000000001,2,
151,,Brazil,Bahia,SALVADOR,1,343.9547910900997,1,12,,,2,0,,,32.59999847412109,1,146,1,,,3,2,,,4,,,,,,2,.0015293675,-1.59,1,1050
152,,Brazil,Mato Grosso,CUIABA,1,24.19745879290504,2,17,,,2,0,,,69.59999847412109,1,173.8500061035156,1,,,3,1,,,4,,,,,,,.0023028189,.58,1,390
153,,Brazil,Parana,CURITIBA,1,37.49036151836691,1,13,,,2,0,,,44.59999847412109,1,154.5,1,,,3,3,,,4,,,,,,,.0018684345,-.06,1,
154,,Brazil,Rio de Janeiro,BELFORD ROXO,1,280.8459721428726,1,14,,,2,0,,,36.95000076293945,1,150.5500030517578,1,,,3,3,,,4,,,,,,3,.0016302451,-1.62,2,
155,,Brazil,Rio de Janeiro,RIO DE JANEIRO,1,133.6706044421819,2,15,,,2,0,,,46.59999847412109,1,155.6000061035156,1,,,3,1,,,4,,,,,,,.0019247162,-.49,1,320
156,,Brazil,Sao Paulo,DIADEMA,1,580.0824164391925,1,14,,,2,0,,,44.25,1,167.3000030517578,1,,,3,1,,,4,,,,,,3,.0015809617,-1.79,2,1200
157,,Brazil,Minas Gerais,BELO HORIZONTE,1,100.9634663651182,1,12,,,2,0,,,30.54999923706055,1,136.8000030517578,1,,,3,1,,,4,,,,,,3,.0016324467,-.6900000000000001,2,30
160,,Brazil,Mato Grosso,VARZEA GRANDE,1,38.93772324668162,1,12,,,2,0,,,29.64999961853027,1,140.6000061035156,1,,,3,2,,,4,,,,,,3,.0014998714,-1.59,2,0
161,,Brazil,Sao Paulo,SAO PAULO,1,1326.665486820796,1,12,,,2,0,,,34.5,1,143.8999938964844,1,,,3,3,,,4,,,,,,,.0016660865,-.49,2,480
162,,Brazil,Parana,CURITIBA,1,53.55227069858698,1,13,,,2,0,,,34.75,1,144,1,,,3,2,,,4,,,,,,,.0016758295,-.86,1,0
165,,Brazil,Para,ANANINDEUA,1,73.49531518817027,2,12,,,2,0,,,36.95000076293945,1,150.5500030517578,1,,,3,1,,,4,,,,,,2,.0016302451,-1.08,4,555
166,,Brazil,Maranhao,SAO LUIS,1,71.44461020180799,2,12,,,2,0,,,38.45000076293945,1,158.3000030517578,1,,,3,2,,,4,,,,,,2,.0015343856,-1.58,2,60
168,,Brazil,Para,CASTANHAL,1,343.4860251717656,2,16,,,2,0,,,42.25,1,156.0500030517578,1,,,3,1,,,4,,,,,,3,.0017349987,-1.44,1,120
169,,Brazil,Paraiba,JOAO PESSOA,1,32.42673509935824,2,12,,,2,0,,,31.04999923706055,1,142.6499938964844,1,,,3,3,,,4,,,,,,1,.0015258719,-1.67,1,0
170,,Brazil,Alagoas,MACEIO,1,67.59877906520089,1,17,,,2,0,,,59.04999923706055,1,178.8500061035156,1,,,3,2,,,4,,,,,,,.0018460437,-1.24,2,1800
171,,Brazil,Sao Paulo,SAO PAULO,1,75.91590435197018,2,16,,,2,0,,,47.29999923706055,1,162.6000061035156,1,,,3,2,,,4,,,,,,3,.0017890398,-1.19,2,2000
172,,Brazil,Distrito Federal,BRASILIA,1,55.51336217585455,2,16,,,2,0,,,47.25,1,152.8000030517578,1,,,3,2,,,4,,,,,,,.0020237418,-.21,1,780
173,,Brazil,Rio de Janeiro,RIO DE JANEIRO,1,188.2130730748305,2,14,,,2,0,,,39.79999923706055,1,154.8999938964844,1,,,3,1,,,4,,,,,,2,.0016587474,-1.57,2,1030
174,,Brazil,Sao Paulo,SAO PAULO,1,51.43600404677114,1,12,,,2,0,,,36.75,1,146.5500030517578,1,,,3,2,,,4,,,,,,,.0017111405,-.47,1,1525
175,,Brazil,Pernambuco,RECIFE,1,36.86817607095075,2,12,,,2,0,,,37.40000152587891,1,145.25,1,,,3,2,,,4,,,,,,1,.0017727168,-.32,2,30
177,,Brazil,Pernambuco,RECIFE,1,147.3322140450923,1,12,,,2,0,,,35.25,1,146,1,,,3,3,,,4,,,,,,,.0016536873,-.71,1,180
178,,Brazil,Rondonia,PORTO VELHO,1,55.07698310293561,2,15,,,2,0,,,45.45000076293945,1,162.9499969482422,1,,,3,3,,,4,,,,,,,.0017116902,-1.35,2,0
179,,Brazil,Paraiba,JOAO PESSOA,1,3.438527184021297,2,15,,,2,0,,,43.29999923706055,1,153.4499969482422,1,,,3,1,,,4,,,,,,,.0018388832,-.75,1,90
180,,Brazil,Mato Grosso,CUIABA,1,44.79975340670953,2,14,,,2,0,,,40.45000076293945,1,162.3999938964844,1,,,2,1,,,4,,,,,,,.0015337216,-2.17,2,180
181,,Brazil,Sao Paulo,OSASCO,1,318.0263316587473,2,12,,,2,0,,,38.45000076293945,1,152.25,1,,,3,3,,,4,,,,,,2,.0016587531,-.9,1,360
182,,Brazil,Minas Gerais,BELO HORIZONTE,1,47.00177249816752,2,12,,,2,0,,,32,1,144.8999938964844,1,,,3,2,,,4,,,,,,,.0015240993,-1.52,2,0
183,,Brazil,Tocantins,PALMAS,1,40.46331555271194,2,15,,,2,0,,,41.59999847412109,1,161.4499969482422,1,,,2,3,,,4,,,,,,,.0015959424,-2.07,2,0
184,,Brazil,Rio Grande do Sul,PORTO ALEGRE,1,128.2904669934466,2,13,,,2,0,,,40.54999923706055,1,154.1999969482422,1,,,3,3,,,4,,,,,,3,.0017053838,-.97,1,320
185,,Brazil,Sao Paulo,SAO BERNARDO DO CAMPO,1,1278.153081160142,1,12,,,2,0,,,30.79999923706055,1,140.5500030517578,1,,,3,3,,,4,,,,,,,.0015591539,-1.38,1,340
186,,Brazil,Rio de Janeiro,RIO DE JANEIRO,1,89.96028272391236,2,12,,,2,0,,,39.25,1,157.1999969482422,1,,,3,2,,,4,,,,,,,.0015883076,-1.04,1,75
187,,Brazil,Piaui,TERESINA,1,79.67437863811259,2,13,,,2,0,,,35.34999847412109,1,156.1999969482422,1,,,2,1,,,4,,,,,,1,.0014488631,-2.43,2,1020
188,,Brazil,Parana,CURITIBA,1,88.4622874778765,2,12,,,2,0,,,40.84999847412109,1,160.3999938964844,1,,,3,2,,,4,,,,,,3,.0015877545,-1.32,2,495
189,,Brazil,Tocantins,PALMAS,1,29.08379652694028,1,13,,,2,0,,,33.29999923706055,1,148.0500030517578,1,,,2,1,,,4,,,,,,,.0015192435,-2.01,2,360
190,,Brazil,Rio de Janeiro,RIO DE JANEIRO,1,564.8417495908551,2,12,,,2,0,,,34.40000152587891,1,149.3999938964844,1,,,3,2,,,4,,,,,,,.0015411939,-1.35,1,180
191,,Brazil,Paraiba,JOAO PESSOA,1,56.72366288297033,2,12,,,2,0,,,37.95000076293945,1,157.4499969482422,1,,,3,2,,,4,,,,,,,.0015308283,-1.7,2,420
192,,Brazil,Sao Paulo,SAO BERNARDO DO CAMPO,1,432.9226860622176,2,13,,,2,0,,,37.79999923706055,1,159.9499969482422,1,,,2,2,,,4,,,,,,3,.0014774858,-2.4,1,360
193,,Brazil,Distrito Federal,BRASILIA,1,74.73243475080434,2,14,,,2,0,,,43.09999847412109,1,167.1999969482422,1,,,2,1,,,4,,,,,,3,.0015417172,-2.04,2,90
194,,Brazil,Acre,RIO BRANCO,1,34.63045658056688,2,14,,,2,0,,,37.29999923706055,1,152.1000061035156,1,,,3,2,,,4,,,,,,3,.0016123167,-1.59,2,1180
196,,Brazil,Para,ANANINDEUA,1,66.93430834500028,2,12,,,2,0,,,37.95000076293945,1,160.8000030517578,1,,,2,2,,,4,,,,,,2,.001467708,-2.12,1,150
197,,Brazil,Sergipe,ARACAJU,1,30.81457049190734,2,13,,,2,0,,,39.54999923706055,1,154.25,1,,,3,2,,,4,,,,,,,.0016622492,-1.13,2,0
198,,Brazil,Sao Paulo,SAO PAULO,1,213.1258315335594,2,13,,,2,0,,,49.79999923706055,1,165.8000030517578,1,,,3,2,,,4,,,,,,,.0018115914,-.34,1,476
199,,Brazil,Paraiba,JOAO PESSOA,1,18.45269614860489,2,12,,,2,0,,,39.25,1,158.5,1,,,3,3,,,4,,,,,,,.0015623601,-1.47,2,120
200,,Brazil,Minas Gerais,BELO HORIZONTE,1,59.38776042756407,1,14,,,2,0,,,34.79999923706055,1,151.6000061035156,1,,,2,3,,,4,,,,,,,.0015141915,-2.39,1,0
201,,Brazil,Alagoas,MACEIO,1,83.28768397358668,2,12,,,2,0,,,37.95000076293945,1,148,1,,,3,1,,,4,,,,,,,.0017325603,-.5600000000000001,2,
202,,Brazil,Parana,CURITIBA,1,61.19905783613802,2,12,,,2,0,,,34.45000076293945,1,143.8000030517578,1,,,3,2,,,4,,,,,,2,.0016659864,-.8,2,90
203,,Brazil,Roraima,BOA VISTA,1,62.93222349292139,2,13,,,2,0,,,45.5,1,151.8000030517578,1,,,3,3,,,4,,,,,,1,.0019745487,.16,2,510
205,,Brazil,Espirito Santo,VITORIA,1,24.82528167671551,2,14,,,2,0,,,42.79999923706055,1,157.6999969482422,1,,,3,2,,,4,,,,,,3,.0017209981,-1.13,1,50
206,,Brazil,Sao Paulo,GUARULHOS,1,392.8910546575676,1,13,,,2,0,,,35.29999923706055,1,150.8000030517578,1,,,3,3,,,4,,,,,,,.0015522869,-1.86,1,
207,,Brazil,Rio Grande do Sul,PORTO ALEGRE,1,28.87143862057732,2,14,,,2,0,,,39.04999923706055,1,155.75,1,,,3,2,,,4,,,,,,,.0016097741,-1.83,1,0
208,,Brazil,Ceara,FORTALEZA,1,111.7490323634436,1,13,,,2,0,,,31.75,1,140.6999969482422,1,,,3,3,,,4,,,,,,3,.0016038198,-1.21,1,