id,hh_id,country,sec_area,tert_area,round,smpl_weight,sex,age,edc_level,edc,residence,preg_lact,breastfeeding,hh_head,wgt,wgt_method,hgt,hgt_method,bmi_adults,bmi_children,bmi_cat,misrep,pa,pa_cat,smok,special_diet,special_diet_other,clin_diet,clin_diet_other,note,sec_area_name,tert_area_name,s_w_anthro,bmi_zscore,bmi_chld,est_var,code_upm,indig_lang,ses_index
106000804,1060008,Mexico,1,1,1,2020.5945,2,9,1,1st grade (elementary school),2,,,,27.775,1,129.05,1,,,2,,,,,,,,,,AGUASCALIENTES,AGUASCALIENTES,726.03021,.25999999,16.677773,15,M0101,0,2
106000901,1060009,Mexico,1,1,1,3814.0007,2,91,1,none,2,,,106000901,,,,,,,,,,,3,,,,,,AGUASCALIENTES,AGUASCALIENTES,,,,15,M0101,0,2
106001106,1060011,Mexico,1,1,1,1380.7205,1,2,2,3rd grade (high school),2,,,,17.275,1,96.699997,1,,,3,,,,,,,,,,AGUASCALIENTES,AGUASCALIENTES,580.42963,2,18.474178,15,M0101,,3
106001506,1060015,Mexico,1,1,1,2020.5945,2,9,1,4th grade (elementary school),2,,,,40.700001,1,148.5,1,,,2,,,,,,,,,,AGUASCALIENTES,AGUASCALIENTES,726.03021,.91000003,18.456167,15,M0101,0,3
106002104,1060021,Mexico,1,1,1,4041.189,2,11,1,5th grade (elementary school),2,,,,51.700001,1,162.60001,1,,,2,,,,3,,,,,,AGUASCALIENTES,AGUASCALIENTES,1222.3848,.63,19.554623,15,M0101,0,3
106003505,1060035,Mexico,1,1,1,1999.1747,1,9,1,4th grade (elementary school),2,,,,41.599998,1,131.10001,1,,,4,,,,,,,,,,AGUASCALIENTES,AGUASCALIENTES,643.31073,2.8299999,24.204042,15,M0101,0,3
106005703,1060057,Mexico,1,1,1,11690.704,1,25,3,4th (bachelor´s degree),2,,,,70.550003,1,183.55,1,20.940557,,2,,,,1,,,,,,AGUASCALIENTES,AGUASCALIENTES,1344.0155,,,15,M0102,1,3
106007101,1060071,Mexico,1,1,1,6267.5815,1,61,3,4th (bachelor´s degree),2,,,106007101,83.400002,1,172.7,1,27.962847,,3,,,,1,,,,,,AGUASCALIENTES,AGUASCALIENTES,877.39282,,,15,M0102,0,3
106007402,1060074,Mexico,1,1,1,4090.8972,2,71,1,6th grade (elementary school),2,,,,77.25,1,152.79999,1,33.086578,,4,,,,3,,,,,,AGUASCALIENTES,AGUASCALIENTES,1324.7831,,,15,M0102,0,3
106008104,1060081,Mexico,1,1,1,1392.3655,2,2,2,3rd grade (high school),2,,,,11.375,1,85.650002,1,,,2,,,,,,,,,,AGUASCALIENTES,AGUASCALIENTES,400.67249,-.02,15.505888,15,M0102,,3
106009702,1060097,Mexico,1,1,1,1903.9819,1,12,1,6th grade (elementary school),2,,,,33.950001,1,149.85001,1,,,2,,,,2,,,,,,AGUASCALIENTES,AGUASCALIENTES,418.0921,-1.5,15.119111,15,M0103,0,2
106009903,1060099,Mexico,1,1,1,4482.021,1,14,2,2nd grade (middle school),2,,,,51.900002,1,164.39999,1,,,2,,,,3,,,,,,AGUASCALIENTES,AGUASCALIENTES,984.19922,-.15000001,19.202765,15,M0103,0,3
106011102,1060111,Mexico,1,1,1,7548.2485,2,64,1,6th grade (elementary school),2,,,,63.700001,1,165.85001,1,23.158394,,2,,,,2,,,,,,AGUASCALIENTES,AGUASCALIENTES,1451.4581,,,15,M0103,0,3
106011201,1060112,Mexico,1,1,1,7709.6797,1,69,2,3rd grade (high school),2,,,106011201,74.800003,1,169.89999,1,25.912834,,3,,,,,,,,,,AGUASCALIENTES,AGUASCALIENTES,970.67957,,,15,M0103,0,3
106011501,1060115,Mexico,1,1,1,2137.6858,2,78,1,6th grade (elementary school),2,,,106011501,,,,,,,,,,,2,,,,,,AGUASCALIENTES,AGUASCALIENTES,,,,15,M0103,0,2
106012303,1060123,Mexico,1,1,1,11690.704,2,34,3,3rd (bachelor´s degree),2,0,,,47.549999,1,160.8,1,18.389858,,1,,,,,,,,,,AGUASCALIENTES,AGUASCALIENTES,1451.4581,,,15,M0103,0,3
106015701,1060157,Mexico,1,1,1,8578.6367,1,49,2,3rd grade (middle school),2,,,106015701,83.800003,1,159.75,1,32.836914,,4,,,,2,,,,,,AGUASCALIENTES,AGUASCALIENTES,867.60974,,,15,M0104,0,1
106016405,1060164,Mexico,1,1,1,1605.9589,2,15,2,1st grade (high school),2,0,,,44.825001,1,163.35001,1,,,2,,,,,,,,,,AGUASCALIENTES,AGUASCALIENTES,355.91779,-1.53,16.798944,15,M0104,0,3
106017901,1060179,Mexico,1,1,1,8181.7944,2,82,2,3rd grade (middle school),2,,,106017901,55.549999,1,142.5,1,27.356112,,3,,,,3,,,,,,AGUASCALIENTES,AGUASCALIENTES,1451.4581,,,15,M0105,0,3
106018103,1060181,Mexico,1,1,1,10426.985,2,26,2,3rd grade (high school),2,0,,,72.75,1,161.60001,1,27.858021,,3,,,,1,,,,,,AGUASCALIENTES,AGUASCALIENTES,918.64502,,,15,M0105,0,3
106019804,1060198,Mexico,1,1,1,1258.2372,1,2,2,1st grade (high school),2,,,,12.8,1,86.900002,1,,,2,,,,,,,,,,AGUASCALIENTES,AGUASCALIENTES,317.84549,.94999999,16.950027,15,M0105,,3
106020006,1060200,Mexico,1,1,1,2784.731,2,4,2,3rd grade (high school),2,,,,15.1,1,101.15,1,,,2,,,,,,,,,,AGUASCALIENTES,AGUASCALIENTES,657.49738,-.34999999,14.7586,15,M0105,0,3
106020705,1060207,Mexico,1,1,1,1258.2372,1,3,2,3rd grade (high school),2,,,,16.65,1,98.599998,1,,,3,,,,,,,,,,AGUASCALIENTES,AGUASCALIENTES,317.84549,1.3099999,17.126177,15,M0105,0,3
106021004,1060210,Mexico,1,1,1,1392.3655,2,1.8288844,2,3rd grade (middle school),2,,,,10.45,1,79.599998,1,,,2,,,,,,,,,,AGUASCALIENTES,AGUASCALIENTES,306.11819,.72000003,16.49264,15,M0105,,3
106022004,1060220,Mexico,1,1,1,1841.3481,2,8,1,1st grade (elementary school),2,,,,36.825001,1,120.55,1,,,4,,,,,,,,,,AGUASCALIENTES,AGUASCALIENTES,397.5769,2.98,25.340099,15,M0105,0,3
106022803,1060228,Mexico,1,1,1,3095.6829,1,19,2,3rd grade (middle school),2,,,,64.400002,1,171,1,,,2,,,,1,,,,,,AGUASCALIENTES,AGUASCALIENTES,515.21698,-.059999999,22.02387,15,M0106,0,3
106023004,1060230,Mexico,1,1,1,6257.7017,2,15,2,3rd grade (middle school),2,0,,,59.049999,1,161.14999,1,,,2,,,,3,,,,,,AGUASCALIENTES,AGUASCALIENTES,1099.5289,.76999998,22.738369,15,M0106,0,3
106023203,1060232,Mexico,1,1,1,2784.731,2,2,2,3rd grade (high school),2,,,,11.9,1,89.199997,1,,,2,,,,,,,,,,AGUASCALIENTES,AGUASCALIENTES,664.64789,-.43000001,14.956062,15,M0106,,3
106023501,1060235,Mexico,1,1,1,8356.7754,1,53,2,2nd grade (middle school),2,,,106023501,87.5,1,169.2,1,30.563803,,4,,,,3,,,,,,AGUASCALIENTES,AGUASCALIENTES,670.0719,,,15,M0106,0,2
106023601,1060236,Mexico,1,1,1,9836.0283,1,39,2,3rd grade (middle school),2,,,106023601,89.275002,1,173.5,1,29.657251,,3,,,,2,,,,,,AGUASCALIENTES,AGUASCALIENTES,788.68292,,,15,M0106,0,3
106023903,1060239,Mexico,1,1,1,1547.8414,1,12,1,6th grade (elementary school),2,,,,47.775002,1,152.7,1,,,3,,,,3,,,,,,AGUASCALIENTES,AGUASCALIENTES,313.44559,1.09,20.48909,15,M0106,0,3
106025901,1060259,Mexico,1,1,1,3475.6619,2,54,3,4th (bachelor´s degree),2,,,106025901,104.35001,1,158.39999,1,41.589348,,4,,,,3,,,,,,AGUASCALIENTES,AGUASCALIENTES,255.71365,,,15,M0106,0,3
106027206,1060272,Mexico,1,1,1,1113.4843,1,3,1,6th grade (elementary school),2,,,,15.725,1,98.5,1,,,2,,,,,,,,,,AGUASCALIENTES,AGUASCALIENTES,276.427,.60000002,16.207581,15,M0108,0,3
106027602,1060276,Mexico,1,1,1,10860.789,2,56,1,6th grade (elementary school),2,,,,71.5,1,156,1,29.380344,,3,,,,1,,,,,,AGUASCALIENTES,AGUASCALIENTES,776.82477,,,15,M0108,0,3
106027701,1060277,Mexico,1,1,1,5546.5322,1,80,1,2nd grade (elementary school),2,,,106027701,71.099998,1,166.25,1,25.724461,,3,,,,3,,,,,,AGUASCALIENTES,AGUASCALIENTES,626.08453,,,15,M0108,0,3
106028204,1060282,Mexico,1,1,1,1369.7712,1,11,1,5th grade (elementary school),2,,,,48.900002,1,151,1,,,3,,,,,,,,,,AGUASCALIENTES,AGUASCALIENTES,269.66779,1.63,21.446428,15,M0108,0,3
106028313,1060283,Mexico,1,1,1,1113.4843,1,2,1,3rd grade (elementary school),2,,,,11.7,1,89,1,,,2,,,,,,,,,,AGUASCALIENTES,AGUASCALIENTES,276.427,-.79000002,14.770862,15,M0108,,2
106028405,1060284,Mexico,1,1,1,1629.5116,2,15,2,2nd grade (middle school),2,0,,,41.599998,1,155.85001,1,,,2,,,,3,,,,,,AGUASCALIENTES,AGUASCALIENTES,278.35211,-1.37,17.126936,15,M0108,0,2
106028607,1060286,Mexico,1,1,1,1629.5116,2,13,1,6th grade (elementary school),2,0,,,38,1,151.05,1,,,2,,,,3,,,,,,AGUASCALIENTES,AGUASCALIENTES,291.07761,-1,16.654903,15,M0108,0,3
106028901,1060289,Mexico,1,1,1,8704.4492,1,50,1,6th grade (elementary school),2,,,106028901,69.75,1,164.45,1,25.791491,,3,,,,1,,,,,,AGUASCALIENTES,AGUASCALIENTES,678.53033,,,15,M0108,0,2
106029905,1060299,Mexico,1,1,1,1848.2727,2,5,1,2nd grade (pre-elementary school),2,,,,19.75,1,111.9,1,,,2,,,,,,,,,,AGUASCALIENTES,AGUASCALIENTES,316.21719,.34,15.772732,15,M0108,0,2
106030804,1060308,Mexico,1,1,1,1629.5116,2,9,1,3rd grade (elementary school),2,,,,24.85,1,130,1,,,2,,,,,,,,,,AGUASCALIENTES,AGUASCALIENTES,345.76859,-1.05,14.704143,15,M0108,0,3
106031203,1060312,Mexico,1,1,1,1805.7062,1,11,1,3rd grade (elementary school),2,,,,30.5,1,135.95,1,,,2,,,,3,,,,,,AGUASCALIENTES,AGUASCALIENTES,334.2746,-.25,16.502184,15,M0109,0,1
106031504,1060315,Mexico,1,1,1,2070.0654,2,5,1,2nd grade (pre-elementary school),2,,,,19.049999,1,113.9,1,,,2,,,,,,,,,,AGUASCALIENTES,AGUASCALIENTES,333.02649,-.38999999,14.684106,15,M0109,0,2
106031901,1060319,Mexico,1,1,1,3444.9038,2,51,2,1st grade (middle school),2,,,106031901,71.400002,1,146.95,1,33.064281,,4,,,,1,,,,,,AGUASCALIENTES,AGUASCALIENTES,231.69359,,,15,M0109,0,2
106032403,1060324,Mexico,1,1,1,10334.712,2,24,2,2nd grade (middle school),2,0,,,57,1,164.39999,1,21.089743,,2,,,,3,,,,,,AGUASCALIENTES,AGUASCALIENTES,841.40558,,,15,M0109,0,2
106032502,1060325,Mexico,1,1,1,10334.712,2,55,1,5th grade (elementary school),2,,,,64.099998,1,149.64999,1,28.622307,,3,,,,3,,,,,,AGUASCALIENTES,AGUASCALIENTES,695.08075,,,15,M0109,0,3
106032703,1060327,Mexico,1,1,1,8109.3892,2,36,3,2nd (master's degree),2,0,,,50.150002,1,165,1,18.42057,,1,,,,3,,,,,,AGUASCALIENTES,AGUASCALIENTES,272.70621,,,15,M0109,0,3
106033308,1060333,Mexico,1,1,1,3650.106,2,17,2,3rd grade (middle school),2,0,,,54.700001,1,152,1,,,2,,,,3,,,,,,AGUASCALIENTES,AGUASCALIENTES,586.29718,.75999999,23.675554,15,M0109,0,3
106034101,1060341,Mexico,1,1,1,6212.1162,1,67,2,3rd grade (middle school),2,,,106034101,79.300003,1,169.25,1,27.683172,,3,,,,,,,,,,AGUASCALIENTES,AGUASCALIENTES,659.36554,,,15,M0109,0,3
106034702,1060347,Mexico,1,1,1,8109.3892,2,33,2,3rd grade (high school),2,0,,,65.800003,1,155,1,27.38814,,3,,,,1,,,,,,AGUASCALIENTES,AGUASCALIENTES,660.22986,,,15,M0109,0,3
106036101,1060361,Mexico,1,1,1,11690.704,2,28,3,4th (bachelor´s degree),2,0,,106036101,66.300003,1,157.55,1,26.710175,,3,,,,3,,,,,,AGUASCALIENTES,AGUASCALIENTES,1329.2358,,,15,M0110,0,3
106038801,1060388,Mexico,1,1,1,11690.704,1,37,3,2nd (master's degree),2,,,106038801,94.949997,1,173.2,1,31.651855,,4,,,,1,,,,,,AGUASCALIENTES,AGUASCALIENTES,719.34863,,,15,M0110,0,3
106039201,1060392,Mexico,1,1,1,6146.4097,2,49,2,3rd grade (high school),2,0,,106039201,63.549999,1,154.10001,1,26.761488,,3,,,,2,,,,,,AGUASCALIENTES,AGUASCALIENTES,549.03741,,,15,M0110,0,3
106039901,1060399,Mexico,1,1,1,8965.583,1,37,3,4th (bachelor´s degree),2,,,106039901,71.550003,1,174.39999,1,23.5243,,2,,,,1,,,,,,AGUASCALIENTES,AGUASCALIENTES,671.68396,,,15,M0111,0,3
106040103,1060401,Mexico,1,1,1,1425.9807,2,13,2,1st grade (middle school),2,0,,,46.275002,1,152.8,1,,,2,,,,3,,,,,,AGUASCALIENTES,AGUASCALIENTES,244.80679,.15000001,19.81982,15,M0111,0,3
106040605,1060406,Mexico,1,1,1,1269.1473,2,4,3,4th (bachelor´s degree),2,,,,18.799999,1,98.199997,1,,,4,,,,,,,,,,AGUASCALIENTES,AGUASCALIENTES,283.0246,2.45,19.495523,15,M0111,0,3
106042403,1060424,Mexico,1,1,1,1269.1473,2,2,2,3rd grade (high school),2,,,,12.625,1,88.849998,1,,,2,,,,,,,,,,AGUASCALIENTES,AGUASCALIENTES,283.0246,.40000001,15.992507,15,M0111,,3
106042603,1060426,Mexico,1,1,1,2851.9614,2,16,2,1st grade (high school),2,0,,,61.299999,1,168.5,1,,,2,,,,3,,,,,,AGUASCALIENTES,AGUASCALIENTES,468.2084,.23,21.590399,15,M0111,0,3
106043001,1060430,Mexico,1,1,1,11690.704,1,41,2,1st grade (middle school),2,,,106043001,97.25,1,165,1,35.720844,,4,,,,,,,,,,AGUASCALIENTES,AGUASCALIENTES,1141.337,,,15,M0111,0,3
106045203,1060452,Mexico,1,1,1,3018.0952,2,16,2,2nd grade (high school),2,0,,,54,1,163,1,,,2,,,,3,,,,,,AGUASCALIENTES,AGUASCALIENTES,279.08029,-.18000001,20.324438,15,M0114,0,3
106045706,1060457,Mexico,1,1,1,1213.6979,1,1.9411362,1,3rd grade (elementary school),2,,,,15.8,1,90.150002,1,,,4,,,,,,,,,,AGUASCALIENTES,AGUASCALIENTES,442.73499,2.52,19.441315,15,M0114,,3
106046005,1060460,Mexico,1,1,1,1213.6979,1,3,2,3rd grade (middle school),2,,,,15.925,1,99.050003,1,,,2,,,,,,,,,,AGUASCALIENTES,AGUASCALIENTES,326.20911,.64999998,16.231941,15,M0114,0,3
106047201,1060472,Mexico,1,1,1,3352.6296,2,75,1,none,2,,,106047201,70.099998,1,166,1,25.439106,,3,,,,3,,,,,,AGUASCALIENTES,AGUASCALIENTES,947.80359,,,15,M0114,0,2
106047508,1060475,Mexico,1,1,1,2686.1565,2,.21355236,2,3rd grade (middle school),2,,,,4.8499999,1,57.700001,1,,,2,,,,,,,,,,AGUASCALIENTES,AGUASCALIENTES,628.34662,-1.1,14.56767,15,M0114,,3
106047604,1060476,Mexico,1,1,1,11690.704,1,20,2,3rd grade (middle school),2,,,,67.350006,1,166.85001,1,24.192747,,2,,,,2,,,,,,AGUASCALIENTES,AGUASCALIENTES,1451.4581,,,15,M0114,0,3
106048602,1060486,Mexico,1,1,1,1509.0476,2,17,2,3rd grade (middle school),2,0,,,,,,,,,,,,,3,,,,,,AGUASCALIENTES,AGUASCALIENTES,,,,15,M0115,0,2
106050602,1060506,Mexico,1,1,1,5028.9443,2,73,1,1st grade (elementary school),2,,,,74.550003,1,148.75,1,33.692539,,4,,,,2,,,,,,AGUASCALIENTES,AGUASCALIENTES,1451.4581,,,15,M0115,0,3
106050704,1060507,Mexico,1,1,1,3552.3354,2,13,1,6th grade (elementary school),2,0,,,36.150002,1,150.5,1,,,2,,,,3,,,,,,AGUASCALIENTES,AGUASCALIENTES,755.9577,-1.4299999,15.96009,15,M0115,0,3
106051401,1060514,Mexico,1,1,1,1757.3391,1,18,2,1st grade (high school),2,,,106051401,72,1,172,1,,,2,,,,3,,,,,,AGUASCALIENTES,AGUASCALIENTES,338.7402,.79000002,24.337481,15,M0115,0,2
106051703,1060517,Mexico,1,1,1,2686.1565,2,2,2,2nd grade (high school),2,,,,12.15,1,86,1,,,2,,,,,,,,,,AGUASCALIENTES,AGUASCALIENTES,742.53528,.63,16.427799,15,M0115,,3
106052107,1060521,Mexico,1,1,1,1343.0782,2,2,1,5th grade (elementary school),2,,1,,13.7,1,93.5,1,,,2,,,,,,,,,,AGUASCALIENTES,AGUASCALIENTES,371.2677,.15000001,15.671022,15,M0115,,2
106052303,1060523,Mexico,1,1,1,5822.6069,2,22,2,3rd grade (high school),2,0,,,50.5,1,159.60001,1,19.825565,,2,,,,3,,,,,,AGUASCALIENTES,AGUASCALIENTES,471.62646,,,16,M0116,0,2
106052904,1060529,Mexico,1,1,1,1526.0104,1,11,1,5th grade (elementary school),2,,,,64.5,1,159.2,1,,,4,,,,3,,,,,,AGUASCALIENTES,AGUASCALIENTES,281.05249,2.51,25.449169,16,M0116,0,3
106054506,1060545,Mexico,1,1,1,1749.4215,2,5,1,2nd grade (pre-elementary school),2,,,,21.65,1,111.4,1,,,3,,,,,,,,,,AGUASCALIENTES,AGUASCALIENTES,280.00311,1.29,17.445663,16,M0116,0,2
106054807,1060548,Mexico,1,1,1,526.96588,1,2,1,4th grade (elementary school),2,,,,16.15,1,91.900002,1,,,4,,,,,,,,,,AGUASCALIENTES,AGUASCALIENTES,122.3849,2.46,19.12236,16,M0116,,3
106055206,1060552,Mexico,1,1,1,874.71075,2,6,1,3rd grade (pre-elementary school),2,,,,,,,,,,,,,,,,,,,,AGUASCALIENTES,AGUASCALIENTES,,,,16,M0116,0,3
106055504,1060555,Mexico,1,1,1,655.20142,2,17,2,3rd grade (middle school),2,0,,,71.650002,1,164.89999,1,,,3,,,,3,,,,,,AGUASCALIENTES,AGUASCALIENTES,104.7034,1.38,26.349655,16,M0116,0,2
106055705,1060557,Mexico,1,1,1,1965.6042,2,11,1,4th grade (elementary school),2,,,,57.450001,1,150.64999,1,,,4,,,,3,,,,,,AGUASCALIENTES,AGUASCALIENTES,328.47049,2.26,25.313477,16,M0116,0,3
106056203,1060562,Mexico,1,1,1,1708.9719,1,12,1,6th grade (elementary school),2,,,,38.575001,1,153.39999,1,,,2,,,,3,,,,,,AGUASCALIENTES,AGUASCALIENTES,412.19379,-.98000002,16.392879,15,M0117,0,3
106058605,1060586,Mexico,1,1,1,1451.9575,1,19,2,2nd grade (high school),2,,,,53.5,1,172.89999,1,,,2,,,,1,,,,,,AGUASCALIENTES,AGUASCALIENTES,287.8183,-1.8200001,17.896324,15,M0117,0,3
106059201,1060592,Mexico,1,1,1,3919.5496,1,63,1,none,2,,,106059201,95.099998,1,174.25,1,31.320953,,4,,,,3,,,,,,AGUASCALIENTES,AGUASCALIENTES,542.04218,,,15,M0117,0,3
106059305,1060593,Mexico,1,1,1,1770.4399,1,7,1,1st grade (elementary school),2,,,,21.35,1,121.5,1,,,2,,,,,,,,,,AGUASCALIENTES,AGUASCALIENTES,372.43561,-.80000001,14.462565,15,M0117,0,1
106060404,1060604,Mexico,1,1,1,1451.9575,1,17,2,2nd grade (high school),2,,,,56.599998,1,160.35001,1,,,2,,,,3,,,,,,AGUASCALIENTES,AGUASCALIENTES,287.8183,.18000001,22.01296,15,M0117,0,3
106062501,1060625,Mexico,1,1,1,1630.1777,2,79,1,6th grade (elementary school),2,,,106062501,63.299999,1,141,1,31.839445,,4,,,,3,,,,,,AGUASCALIENTES,AGUASCALIENTES,527.00189,,,15,M0118,0,3
106062607,1060626,Mexico,1,1,1,1306.1128,2,4,1,1st grade (elementary school),2,,,,15.35,1,107.6,1,,,2,,,,,,,,,,AGUASCALIENTES,AGUASCALIENTES,375.2045,-1.52,13.258179,15,M0118,0,2
106064704,1060647,Mexico,1,1,1,3417.9438,1,13,2,2nd grade (middle school),2,,,,72.349998,1,166.25,1,,,4,,,,3,,,,,,AGUASCALIENTES,AGUASCALIENTES,833.06653,2.1300001,26.17672,15,M0118,0,2
106064906,1060649,Mexico,1,1,1,1306.1128,2,2,2,3rd grade (middle school),2,,,,12.95,1,94.949997,1,,,2,,,,,,,,,,AGUASCALIENTES,AGUASCALIENTES,375.2045,-.93000001,14.364147,15,M0118,,3
106065503,1060655,Mexico,1,1,1,1727.2823,2,12,1,6th grade (elementary school),2,0,,,41.275002,1,148.10001,1,,,2,,,,3,,,,,,AGUASCALIENTES,AGUASCALIENTES,381.98679,.30000001,18.818151,15,M0118,0,3
106065804,1060658,Mexico,1,1,1,1776.1677,2,10,1,2nd grade (elementary school),2,,,,56.849998,1,144.60001,1,,,4,,,,,,,,,,AGUASCALIENTES,AGUASCALIENTES,408.75769,2.8099999,27.189037,15,M0119,0,3
106068004,1060680,Mexico,1,1,1,1493.0507,1,18,2,3rd grade (high school),2,,,,67.849998,1,178.60001,1,,,2,,,,3,,,,,,AGUASCALIENTES,AGUASCALIENTES,262.00369,-.28999999,21.27095,15,M0119,0,2
106068402,1060684,Mexico,1,1,1,5028.9443,2,72,1,3rd grade (elementary school),2,,,,56.450001,1,137.70001,1,29.771177,,3,,,,3,,,,,,AGUASCALIENTES,AGUASCALIENTES,474.73697,,,15,M0119,0,3
106068604,1060686,Mexico,1,1,1,3514.6782,1,13,1,5th grade (elementary school),2,,,,50.799999,1,170,1,,,2,,,,3,,,,,,AGUASCALIENTES,AGUASCALIENTES,750.44788,-.36000001,17.577854,15,M0119,0,2
106069101,1060691,Mexico,1,1,1,9487.8506,1,31,3,4th (bachelor´s degree),2,,,106069101,123,1,169.25,1,42.938587,,4,,,,1,,,,,,AGUASCALIENTES,AGUASCALIENTES,889.63812,,,15,M0119,0,2
106069203,1060692,Mexico,1,1,1,11690.704,2,27,3,4th (bachelor´s degree),2,0,,,55.599998,1,161.60001,1,21.290802,,2,,,,1,,,,,,AGUASCALIENTES,AGUASCALIENTES,1259.306,,,15,M0119,0,3
106069404,1060694,Mexico,1,1,1,2986.1013,1,19,2,2nd grade (high school),2,,,,90.199997,1,176.85001,1,,,3,,,,,,,,,,AGUASCALIENTES,AGUASCALIENTES,524.00739,1.8200001,28.840075,15,M0119,0,3
106070003,1060700,Mexico,1,1,1,2014.6173,2,6,1,3rd grade (pre-elementary school),2,,,,27.375,1,118.9,1,,,3,,,,,,,,,,AGUASCALIENTES,AGUASCALIENTES,373.82291,2,19.363792,15,M0119,0,3
106071002,1060710,Mexico,1,1,1,11690.704,2,49,1,6th grade (elementary school),2,0,,,68.050003,1,159.45,1,26.765732,,3,,,,3,,,,,,AGUASCALIENTES,AGUASCALIENTES,1389.7593,,,15,M0120,0,3
106071301,1060713,Mexico,1,1,1,7381.937,2,46,2,3rd grade (high school),2,0,,106071301,67.800003,1,155.05,1,28.202406,,3,,,,,,,,,,AGUASCALIENTES,AGUASCALIENTES,590.37579,,,15,M0120,0,3
106071701,1060717,Mexico,1,1,1,11690.704,1,54,2,3rd grade (middle school),2,,,106071701,77.550003,1,169.20001,1,27.088255,,3,,,,1,,,,,,AGUASCALIENTES,AGUASCALIENTES,1160.2653,,,15,M0120,0,2
106074503,1060745,Mexico,1,1,1,1336.1812,1,1.8699521,3,1st (master's degree),2,,,,14.5,1,87.199997,1,,,4,,,,,,,,,,AGUASCALIENTES,AGUASCALIENTES,503.39151,2.27,19.069313,15,M0120,,3
106074806,1060748,Mexico,1,1,1,3869.3704,1,14,2,2nd grade (middle school),2,,,,89,1,162.5,1,,,4,,,,3,,,,,,AGUASCALIENTES,AGUASCALIENTES,851.76129,3.03,33.704144,15,M0120,0,3
106075103,1060751,Mexico,1,1,1,3211.9177,2,16,2,3rd grade (middle school),2,0,,,38.799999,1,149.2,1,,,2,,,,,,,,,,AGUASCALIENTES,AGUASCALIENTES,637.59528,-1.4400001,17.429867,15,M0121,0,2
106075303,1060753,Mexico,1,1,1,1870.1957,1,8,1,2nd grade (elementary school),2,,,,29.15,1,135.8,1,,,2,,,,,,,,,,AGUASCALIENTES,AGUASCALIENTES,413.00311,-.02,15.80662,15,M0121,0,2
106076106,1060761,Mexico,1,1,1,1429.3309,2,4,1,6th grade (elementary school),2,,,,21.1,1,114.8,1,,,2,,,,,,,,,,AGUASCALIENTES,AGUASCALIENTES,385.41629,.50999999,16.010271,15,M0121,0,3
106076504,1060765,Mexico,1,1,1,1605.9589,2,19,2,2nd grade (high school),2,0,,,,,,,,,,,,,,,,,,,AGUASCALIENTES,AGUASCALIENTES,,,,15,M0121,0,3
106076601,1060766,Mexico,1,1,1,4289.3184,1,63,3,5th (bachelor´s degree),2,,,106076601,72.300003,1,165.3,1,26.460169,,3,,,,2,,,,,,AGUASCALIENTES,AGUASCALIENTES,562.65649,,,15,M0121,0,2
106077704,1060777,Mexico,1,1,1,3211.9177,2,10,1,4th grade (elementary school),2,,,,40.849998,1,138.8,1,,,3,,,,3,,,,,,AGUASCALIENTES,AGUASCALIENTES,666.74438,1.5,21.20377,15,M0121,0,3
106078204,1060782,Mexico,1,1,1,3780.467,2,9,1,3rd grade (elementary school),2,,,,37.950001,1,128.89999,1,,,4,,,,,,,,,,AGUASCALIENTES,AGUASCALIENTES,932.21729,2.1600001,22.840521,15,M0121,0,1
106078305,1060783,Mexico,1,1,1,1937.4626,1,6,1,3rd grade (pre-elementary school),2,,,,19.799999,1,111.55,1,,,2,,,,,,,,,,AGUASCALIENTES,AGUASCALIENTES,386.59961,.43000001,15.912045,15,M0121,0,3
106078702,1060787,Mexico,1,1,1,11690.704,2,50,2,3rd grade (middle school),2,,,,86.050003,1,152.89999,1,36.807468,,4,,,,3,,,,,,AGUASCALIENTES,AGUASCALIENTES,1205.0601,,,15,M0122,0,3
106078805,1060788,Mexico,1,1,1,1180.2933,1,.62422997,1,6th grade (elementary school),2,,,,7.4000001,1,67.5,1,,,2,,,,,,,,,,AGUASCALIENTES,AGUASCALIENTES,411.004,-.77999997,16.241426,15,M0122,,3
106078904,1060789,Mexico,1,1,1,2935.0283,2,13,1,6th grade (elementary school),2,0,,,36.849998,1,143.10001,1,,,2,,,,3,,,,,,AGUASCALIENTES,AGUASCALIENTES,541.84583,-.40000001,17.995262,15,M0122,0,2
106079103,1060791,Mexico,1,1,1,4355.8726,1,19,2,3rd grade (middle school),2,,,,63,1,168.14999,1,,,2,,,,1,,,,,,AGUASCALIENTES,AGUASCALIENTES,728.39392,.029999999,22.281624,15,M0122,0,3
106079205,1060792,Mexico,1,1,1,4355.8726,1,11,1,5th grade (elementary school),2,,,,36.325001,1,152.75,1,,,2,,,,3,,,,,,AGUASCALIENTES,AGUASCALIENTES,886.27448,-.81999999,15.568372,15,M0122,0,1
106079507,1060795,Mexico,1,1,1,1180.2933,1,2,2,3rd grade (middle school),2,,,,,,,,,,,,,,,,,,,,AGUASCALIENTES,AGUASCALIENTES,,,,15,M0122,,2
106080003,1060800,Mexico,1,1,1,1180.2933,1,.92539358,2,3rd grade (middle school),2,,,,10.35,1,74.599998,1,,,3,,,,,,,,,,AGUASCALIENTES,AGUASCALIENTES,411.004,1.16,18.597849,15,M0122,,2
106080906,1060809,Mexico,1,1,1,5807.8301,1,17,2,1st grade (high school),2,,,,74.650002,1,172.85001,1,,,3,,,,3,,,,,,AGUASCALIENTES,AGUASCALIENTES,971.19177,1.1,24.985672,15,M0122,0,2
106084503,1060845,Mexico,1,1,1,1939.1189,2,13,2,1st grade (middle school),2,0,,,46.5,1,161.05,1,,,2,,,,3,,,,,,AGUASCALIENTES,AGUASCALIENTES,357.37949,-.41999999,17.927984,15,M0123,0,2
106084604,1060846,Mexico,1,1,1,5755.6885,1,19,2,1st grade (middle school),2,,,,72.75,1,172,1,,,2,,,,2,,,,,,AGUASCALIENTES,AGUASCALIENTES,960.83801,.75999999,24.590996,15,M0123,0,2
106085104,1060851,Mexico,1,1,1,2199.4446,2,5,1,2nd grade (pre-elementary school),2,,,,19.225,1,111.9,1,,,2,,,,,,,,,,AGUASCALIENTES,AGUASCALIENTES,388.24539,.07,15.353456,15,M0123,0,3
106087702,1060877,Mexico,1,1,1,8399.0098,2,21,2,3rd grade (middle school),2,0,,,72.449997,1,160.20001,1,28.230156,,3,,,,2,,,,,,AGUASCALIENTES,AGUASCALIENTES,671.82159,,,15,M0124,0,2
106088001,1060880,Mexico,1,1,1,3567.936,2,44,2,3rd grade (middle school),2,0,,106088001,61.150002,1,154.64999,1,25.567993,,3,,,,1,,,,,,AGUASCALIENTES,AGUASCALIENTES,235.76146,,,15,M0124,0,3
106089704,1060897,Mexico,1,1,1,1291.6417,1,1.8398358,1,6th grade (elementary school),2,,,,12.675,1,88,1,,,2,,,,,,,,,,AGUASCALIENTES,AGUASCALIENTES,402.04999,.41999999,16.36751,15,M0124,,2
106090506,1060905,Mexico,1,1,1,1429.3309,2,4,2,3rd grade (middle school),2,,,,17.275,1,101.9,1,,,2,,,,,,,,,,AGUASCALIENTES,AGUASCALIENTES,306.3942,.88999999,16.636795,15,M0124,0,3
106090905,1060909,Mexico,1,1,1,5610.5869,1,14,2,2nd grade (middle school),2,,,,54.150002,1,170.60001,1,,,2,,,,3,,,,,,AGUASCALIENTES,AGUASCALIENTES,1020.4305,-.23999999,18.605459,15,M0124,0,3
106091103,1060911,Mexico,1,1,1,3177.8691,1,15,2,3rd grade (middle school),2,,,,53.150002,1,165.8,1,,,2,,,,2,,,,,,AGUASCALIENTES,AGUASCALIENTES,475.017,-.41999999,19.334557,15,M0124,0,3
106091705,1060917,Mexico,1,1,1,5328.5029,2,12,1,6th grade (elementary school),2,0,,,38,1,156.35001,1,,,2,,,,3,,,,,,AGUASCALIENTES,AGUASCALIENTES,981.31641,-1.49,15.544895,15,M0126,0,3
106091903,1060919,Mexico,1,1,1,5972.2026,1,18,2,3rd grade (high school),2,,,,74.800003,1,179.5,1,,,2,,,,3,,,,,,AGUASCALIENTES,AGUASCALIENTES,996.24469,.46000001,23.215216,15,M0126,0,3