id,hh_id,country,sec_area,tert_area,round,smpl_weight,sex,age,edc_level,edc,residence,preg_lact,breastfeeding,hh_head,wgt,wgt_method,hgt,hgt_method,bmi_adults,bmi_children,bmi_cat,misrep,pa,pa_cat,smok,special_diet,special_diet_other,clin_diet,clin_diet_other,note,smpl_weight_24hr1,smpl_weight_24hr2,edc_level_adults,edc_level_children,race,country_birth,marital_status,hh_size,fam_size,hh_income,fam_income,recum_length,recum_length_method,bmi_chld,psu,stratum
83732,,United States of America,,,1,135629.507405,1,62,,,,,0,,94.8,1,184.5,1,27.799999,,3,,920,2,2,0,,0,,,92670.69991900001,69945.93410699999,5,,3,1,1,2,2,10,10,,,,1,125
83733,,United States of America,,,1,25282.425927,1,53,,,,,0,,90.40000000000001,1,171.4,1,30.799999,,4,,,,1,0,,0,,,16454.105994,13190.26887,3,,3,2,3,1,1,4,4,,,,1,125
83734,,United States of America,,,2,12575.838818,1,78,,,,,0,,83.40000000000001,1,170.1,1,28.799999,,3,,3840,3,2,3,,,,,6529.619788,4928.422423,3,,3,1,1,2,2,5,5,,,,1,131
83735,,United States of America,,,2,102078.634508,2,56,,,,,0,,109.8,1,160.9,1,42.400002,,4,,1800,2,5,0,,0,,,58191.539622,0,5,,3,1,6,1,1,10,10,,,,1,131
83736,,United States of America,,,2,18234.736219,2,42,,,,1,0,,55.2,1,164.9,1,20.299999,,2,,13440,3,3,0,,0,,,12358.085471,9813.677587,4,,4,1,3,5,5,7,7,,,,2,126
83737,,United States of America,,,1,10878.684022,2,72,,,,,0,,64.40000000000001,1,150,1,28.6,,3,,,,3,0,,0,,,5360.309306,4314.249875,2,,1,2,4,5,5,11,11,,,,1,128
83738,,United States of America,,,1,9860.624532,2,11,,,,,0,,37.2,1,143.5,1,,,,,,,,0,,0,,,10699.881234,9608.398144000001,,6,1,1,,5,5,6,6,,,18.1,1,120
83739,,United States of America,,,2,46173.307234,1,4,,,,,0,,16.4,1,102.1,1,,,,,,,,0,,0,,,33678.410699,27862.849206,,,3,1,,5,5,12,12,,,15.7,2,124
83740,,United States of America,,,2,10963.31371,1,1.083333333333333,,,,,0,,10.1,1,,,,,,,,,,0,,0,,,6390.995052,5431.249335,,,2,1,,7,7,,,,,,1,119
83741,,United States of America,,,1,39353.307397,1,22,,,,,0,,76.59999999999999,1,165.4,1,28,,3,,1280,2,1,0,,0,,,23753.827627,19543.578533,4,,4,1,5,3,3,7,7,,,,2,128
83742,,United States of America,,,1,23557.163453,2,32,,,,0,0,,64.5,1,151.3,1,28.200001,,3,,2000,2,5,0,,0,,,16409.157672,14409.85879,4,,1,2,1,4,4,6,6,,,,1,125
83744,,United States of America,,,1,20068.662891,1,56,,,,,0,,108.3,1,179.4,1,33.599998,,4,,1920,2,5,0,,0,,,39927.461278,42766.592413,3,,4,1,3,1,1,3,3,,,,2,126
83745,,United States of America,,,2,25399.385035,2,15,,,,,0,,71.7,1,169.2,1,,,,,1200,2,,0,,0,,,53067.789021,71106.9047,,9,3,1,,3,3,4,4,,,25,2,126
83747,,United States of America,,,1,35673.964272,1,46,,,,,0,,86.2,1,176.7,1,27.6,,3,,4200,3,1,0,,0,,,20532.818013,16459.92741,5,,3,2,6,2,2,3,3,,,,1,121
83748,,United States of America,,,2,11184.295239,1,3,,,,,0,,17.3,1,103.6,1,,,,,,,,0,,0,,,7585.412761,6269.683503,,,4,1,,6,6,6,6,104.2,1,16.1,2,131
83749,,United States of America,,,1,63059.812938,2,17,,,,,0,,75.90000000000001,1,161.7,1,,,,,3660,3,,0,,0,,,40074.927657,33479.025735,,10,3,1,,5,5,11,11,,,29,2,131
83750,,United States of America,,,1,97001.98787700001,1,45,,,,,0,,76.2,1,177.8,1,24.1,,2,,1440,2,2,0,,0,,,63130.05701,0,2,,6,1,5,5,1,10,4,,,,1,125
83751,,United States of America,,,1,14802.213772,2,16,,,,,0,,51.7,1,152.6,1,,,,,,,,0,,0,,,15164.759904,0,,9,1,1,,6,6,4,4,,,22.200001,1,128
83752,,United States of America,,,1,38680.531261,2,30,,,,0,0,,71.2,1,163.6,1,26.6,,3,,4680,3,2,0,,0,,,26943.606244,23660.785583,4,,2,1,6,2,2,12,12,,,,1,124
83753,,United States of America,,,1,14181.702736,1,15,,,,,0,,71.2,1,170.5,1,,,,,9180,3,,0,,0,,,9567.291071,29535.871383,,8,4,1,,3,3,8,8,,,24.5,1,119
83754,,United States of America,,,1,10191.914345,2,67,,,,,0,,117.8,1,164.1,1,43.700001,,4,,700,2,3,0,,0,,,16510.376474,17771.88726,5,,2,1,1,7,7,6,6,,,,1,128
83755,,United States of America,,,2,13991.639152,1,67,,,,,0,,97.40000000000001,1,183.8,1,28.799999,,3,,2160,2,3,0,,0,,,22208.398382,22397.052263,5,,4,1,2,1,1,5,5,,,,1,126
83756,,United States of America,,,2,46918.697172,1,16,,,,,0,,60,1,163.9,1,,,,,10800,3,,0,,0,,,34040.549677,28680.575338,,9,3,1,,6,6,7,7,,,22.299999,1,122
83757,,United States of America,,,1,12413.062527,2,57,,,,,0,,80.5,1,150.8,1,35.400002,,4,,1240,2,5,0,,0,,,25204.887898,28815.135745,1,,2,1,4,5,5,5,5,,,,1,120
83759,,United States of America,,,1,19250.414038,2,19,,,,,0,,100.8,1,175.4,1,,,,,1080,2,3,0,,0,,,13254.191824,11908.031091,,15,1,1,,3,3,7,7,,,32.799999,2,121
83760,,United States of America,,,2,8919.396129000001,2,3,,,,,0,,14.6,1,94.7,1,,,,,,,,0,,0,,,19697.974985,25892.707605,,,4,1,,6,6,7,7,96.5,1,16.299999,2,126
83761,,United States of America,,,2,18010.012692,2,24,,,,0,0,,61.8,1,156.4,1,25.299999,,3,,,,5,0,,0,,,15323.551547,12691.587292,5,,5,2,5,1,1,1,1,,,,1,119
83762,,United States of America,,,2,43424.328288,2,27,,,,0,0,,107.9,1,168.5,1,38,,4,,,,1,0,,0,,,25960.513763,21178.370419,4,,4,1,5,2,1,8,6,,,,1,132
83763,,United States of America,,,1,18158.809883,2,2,,,,,0,,12.1,1,89.8,1,,,,,,,,0,,0,,,41323.611306,58472.05174,,,2,1,,5,5,9,9,90.5,1,15,1,127
83764,,United States of America,,,2,70889.80172,1,14,,,,,0,,54.8,1,170.8,1,,,,,7200,3,,0,,0,,,45485.819072,38323.689631,,8,3,1,,4,4,12,12,,,18.799999,2,120
83765,,United States of America,,,2,14073.383109,2,.1666666666666667,,,,,3,,5.2,1,,,,,,,,,,0,,0,,,11159.777684,8743.975413,,,3,1,,3,3,9,9,60.7,1,,2,123
83766,,United States of America,,,2,47166.956028,2,10,,,,,0,,51,1,160,1,,,,,,,,0,,0,,,104378.562086,0,,4,3,1,,5,5,11,11,,,19.9,1,126
83767,,United States of America,,,1,23219.518074,2,54,,,,,0,,59,1,149.9,1,26.299999,,3,,,,5,0,,0,,,17516.745797,14122.489786,4,,5,2,3,6,6,11,11,,,,2,122
83768,,United States of America,,,2,23022.326092,2,15,,,,,0,,52.4,1,158,1,,,,,10080,3,,0,,0,,,16543.509005,13820.625416,,10,3,1,,5,5,6,6,,,21,2,120
83769,,United States of America,,,2,28350.831746,1,49,,,,,0,,72.8,1,170.7,1,25,,3,,,,5,0,,0,,,21594.2547,17558.495145,2,,5,2,1,4,4,10,10,,,,1,132
83770,,United States of America,,,1,15588.713904,1,15,,,,,0,,48,1,162,1,,,,,7800,3,,0,,0,,,15648.279173,48308.926485,,8,4,1,,4,4,4,4,,,18.299999,2,132
83772,,United States of America,,,1,8064.033105,2,2,,,,,0,,15.2,1,93.8,1,,,,,,,,0,,0,,,8060.210759,0,,,6,1,,3,2,5,5,94.40000000000001,1,17.299999,2,125
83773,,United States of America,,,2,39939.418885,2,80,,,,,0,,67.7,1,149.8,1,30.200001,,4,,,,3,5,Sugar free/Low sugar diet,,,,27028.242784,20227.705035,3,,3,1,2,1,1,7,7,,,,1,131
83774,,United States of America,,,1,73774.46371900001,2,13,,,,,0,,55.9,1,169.7,1,,,,,360,1,,0,,0,,,69762.465375,58280.314157,,7,3,1,,6,6,12,12,,,19.4,1,133
83775,,United States of America,,,2,8799.980525000001,2,69,,,,,0,,77.7,1,160.2,1,30.299999,,4,,5040,3,2,0,,0,,,14255.515354,18402.595617,1,,2,2,4,1,1,2,2,,,,2,119
83776,,United States of America,,,1,21493.64217,2,58,,,,,0,,56.6,1,157.5,1,22.799999,,2,,,,5,0,,0,,,15010.200055,12831.022058,5,,1,1,1,3,3,11,11,,,,2,128
83777,,United States of America,,,1,14484.987902,1,56,,,,,0,,69,1,166.1,1,25,,3,,240,1,3,0,,0,,,12475.24013,0,2,,5,2,1,5,5,7,7,,,,2,133
83778,,United States of America,,,1,18651.126141,1,16,,,,,0,,99.90000000000001,1,170.2,1,,,,,4200,3,,0,,0,,,14660.500174,13283.934521,,10,2,1,,4,4,5,5,,,34.5,1,127
83780,,United States of America,,,1,18941.868594,1,4,,,,,0,,18.2,1,103.9,1,,,,,,,,0,,0,,,13237.871812,11778.195296,,,1,1,,5,5,11,11,,,16.9,1,128
83781,,United States of America,,,2,38537.18944,2,27,,,,0,0,,87.8,1,160.7,1,34,,4,,12960,3,5,0,,0,,,75743.947434,82639.62170800001,5,,4,1,5,2,2,,,,,,2,119
83783,,United States of America,,,2,89837.26915399999,1,17,,,,,0,,96.40000000000001,1,171.1,1,,,,,2800,2,,0,,0,,,85771.793167,0,,11,3,1,,4,4,12,12,,,32.900002,2,129
83784,,United States of America,,,1,42493.486456,1,22,,,,,0,,73.7,1,170.7,1,25.299999,,3,,12000,3,2,0,,0,,,86893.48343399999,123433.371429,4,,2,1,5,4,4,,,,,,2,121
83786,,United States of America,,,2,28391.195299,1,51,,,,,0,,102.1,1,182.2,1,30.799999,,4,,1440,2,3,0,,0,,,25564.947375,0,4,,4,1,5,2,1,,,,,,2,129
83787,,United States of America,,,1,10732.606587,2,68,,,,,0,,77.40000000000001,1,152,1,33.5,,4,,,,3,0,,0,,,17386.270067,22444.120005,1,,1,2,3,1,1,4,4,,,,1,128
83788,,United States of America,,,2,49234.971244,2,69,,,,,0,,84,1,164.6,1,31,,4,,8640,3,2,0,,0,,,73617.62318900001,88367.243608,4,,3,1,1,3,3,7,7,,,,2,120
83789,,United States of America,,,2,181461.242024,1,66,,,,,0,,102.9,1,173.9,1,34,,4,,1840,2,5,0,,0,,,123985.854024,93581.966936,5,,3,1,6,2,1,10,9,,,,1,132
83790,,United States of America,,,1,32402.172747,1,56,,,,,0,,85.59999999999999,1,187.4,1,24.4,,2,,4800,3,1,0,,0,,,61313.914115,78835.007803,1,,3,1,1,2,2,4,4,,,,2,126
83791,,United States of America,,,2,62213.984015,2,80,,,,,0,,78.59999999999999,1,167.6,1,28,,3,,,,3,0,,0,,,42102.131465,31508.874011,2,,3,1,1,2,2,14,14,,,,2,123
83792,,United States of America,,,2,13485.705041,2,3,,,,,0,,17.4,1,103.8,1,,,,,,,,0,,0,,,9334.623791,0,,,1,1,,3,2,11,7,105.3,1,16.1,1,120
83793,,United States of America,,,1,18319.710523,2,11,,,,,0,,56.3,1,157.7,1,,,,,,,,0,,0,,,12331.171672,0,,5,3,1,,6,6,7,7,,,22.6,2,128
83795,,United States of America,,,2,28083.547434,1,5,,,,,0,,23,1,120.2,1,,,,,,,,0,,0,,,20483.896455,62153.208071,,,3,1,,4,4,9,9,,,15.9,1,126
83796,,United States of America,,,2,34556.852945,2,4,,,,,0,,20.3,1,102.6,1,,,,,,,,0,,0,,,24964.484464,20478.837844,,,3,1,,4,4,6,6,,,19.299999,1,130
83797,,United States of America,,,2,10850.57886,2,1.5,,,,,0,,9.800000000000001,1,,,,,,,,,,0,,0,,,7083.790699,5969.057322,,,2,1,,5,5,12,12,82.90000000000001,1,,2,120
83798,,United States of America,,,2,18351.660886,2,.5833333333333334,,,,,0,,8.199999999999999,1,,,,,,,,,,0,,0,,,32153.217745,33692.943594,,,6,1,,4,4,12,12,67,1,,2,130
83801,,United States of America,,,1,61722.129659,2,80,,,,,0,,58.5,1,157.1,1,23.700001,,2,,,,2,0,,0,,,28071.219649,21008.259974,5,,3,1,1,2,2,,,,,,2,132
83803,,United States of America,,,2,21170.1696,1,27,,,,,0,,79.09999999999999,1,166.3,1,28.6,,3,,,,3,0,,0,,,42011.135807,55439.030512,4,,4,1,3,1,1,6,6,,,,2,126
83804,,United States of America,,,1,11178.735123,1,1.166666666666667,,,,,3,,12.6,1,,,,,,,,,,0,,0,,,9696.49986,8240.361319,,,1,1,,6,6,4,4,78.2,1,,1,120
83807,,United States of America,,,1,9745.235573,2,10,,,,,0,,47.3,1,150.1,1,,,,,,,,0,,0,,,8035.807954,7216.084042,,4,1,1,,7,7,14,14,,,21,2,133
83808,,United States of America,,,1,8502.744352,1,4,,,,,0,,21.9,1,112.3,1,,,,,,,,0,,0,,,8207.198881,0,,,5,1,,7,7,10,10,,,17.4,1,129
83809,,United States of America,,,2,40405.577191,2,20,,,,0,0,,72.90000000000001,1,166.8,1,26.200001,,3,,13440,3,3,0,,0,,,79416.22000099999,86646.215318,3,,4,1,5,4,4,11,11,,,,1,129
83810,,United States of America,,,1,7644.73403,2,6,,,,,0,,24,1,121,1,,,,,,,,0,,0,,,6117.512012,0,,0,4,1,,6,6,7,7,,,16.4,2,133
83811,,United States of America,,,2,40455.136622,2,7,,,,,0,,27.9,1,123.4,1,,,,,,,,0,,0,,,89525.57776,119898.358692,,1,3,1,,7,7,12,12,,,18.299999,2,120
83812,,United States of America,,,1,9985.161752,2,68,,,,,0,,63.7,1,147.9,1,29.1,,3,,,,3,0,,0,,,4920.039534,14523.158576,3,,1,1,1,3,3,12,12,,,,1,124
83813,,United States of America,,,2,127925.616456,1,24,,,,,0,,89.2,1,182.2,1,26.9,,3,,44940,3,2,0,,0,,,241451.136087,0,4,,3,1,3,1,1,6,6,,,,1,130
83815,,United States of America,,,1,14892.709535,2,15,,,,,0,,80.90000000000001,1,159.1,1,,,,,1480,2,,3,,,,,11251.761073,34442.13559,,10,4,1,,6,6,6,6,,,32,1,121
83816,,United States of America,,,2,73364.003944,1,27,,,,,0,,59.3,1,178.4,1,18.6,,2,,3120,3,5,0,,0,,,138469.70287,152508.451807,4,,3,1,6,3,1,7,1,,,,1,126
83817,,United States of America,,,2,156668.5007,1,42,,,,,0,,86.09999999999999,1,183.7,1,25.5,,3,,200,1,3,5,Low carbohydrate diet,,,,134175.913895,394485.424926,5,,3,1,1,5,5,12,12,,,,2,124
83818,,United States of America,,,2,8609.625239999999,2,80,,,,,0,,72.3,1,159.2,1,28.5,,3,,600,2,3,0,,0,,,6312.384222,5080.528247,1,,2,2,2,1,1,3,3,,,,2,119
83819,,United States of America,,,1,36859.21159,2,16,,,,,0,,78.3,1,156.2,1,,,,,,,,0,,0,,,34854.736214,29118.021639,,8,3,1,,4,4,8,8,,,32.099998,2,132
83820,,United States of America,,,2,57057.111281,1,70,,,,,0,,81.7,1,173.8,1,27,,3,,8880,3,2,0,,0,,,26200.063811,19775.268111,5,,3,1,6,2,1,10,8,,,,2,132
83821,,United States of America,,,2,16856.90242,1,80,,,,,0,,79.8,1,165.7,1,29.1,,3,,,,2,0,,0,,,25448.258342,0,1,,3,1,2,1,1,3,3,,,,1,130
83822,,United States of America,,,2,35683.4136,2,20,,,,0,0,,60.4,1,164.8,1,22.200001,,2,,240,1,3,0,,0,,,21332.736427,0,4,,4,1,5,2,2,6,6,,,,2,126
83824,,United States of America,,,2,17901.767853,1,23,,,,,0,,72.40000000000001,1,180.3,1,22.299999,,2,,2480,2,3,0,,0,,,15378.483984,12845.803159,5,,5,2,5,4,1,,1,,,,1,119
83825,,United States of America,,,1,17985.284751,2,16,,,,,0,,55.6,1,160.5,1,,,,,3000,3,,0,,0,,,12017.26777,0,,10,4,1,,6,6,6,6,,,21.6,1,121
83826,,United States of America,,,1,13555.028429,1,6,,,,,0,,21.8,1,107.6,1,,,,,,,,0,,0,,,11285.21478,37484.363033,,0,1,1,,7,7,,,,,18.799999,1,120
83827,,United States of America,,,2,15028.726858,1,61,,,,,0,,93,1,177.5,1,29.5,,3,,360,1,2,0,,0,,,23854.52838,28851.210952,3,,4,1,1,2,2,10,10,,,,1,126
83828,,United States of America,,,2,30343.023526,2,39,,,,0,0,,71.3,1,162,1,27.200001,,3,,,,1,0,,0,,,61454.191245,86557.690564,3,,1,2,1,7,7,4,4,,,,2,129
83829,,United States of America,,,1,19543.327056,1,50,,,,,0,,65.8,1,170.6,1,22.6,,2,,1680,2,5,0,,0,,,14885.756648,12103.751181,5,,5,2,1,5,5,12,12,,,,2,122
83830,,United States of America,,,1,13149.569579,1,15,,,,,0,,77.2,1,175.5,1,,,,,2400,2,,0,,0,,,29164.858236,39375.342532,,7,4,1,,4,4,8,8,,,25.1,2,131
83831,,United States of America,,,2,37002.604886,2,15,,,,,0,,92.2,1,173.9,1,,,,,,,,0,,0,,,26589.534207,22213.182956,,9,6,1,,7,7,6,6,,,30.5,1,130
83832,,United States of America,,,1,12034.175845,2,50,,,,,0,,105.9,1,157.7,1,42.599998,,4,,240,1,5,0,,0,,,8404.131115,26347.816653,1,,1,2,4,5,5,7,7,,,,1,121
83833,,United States of America,,,1,26206.988732,1,14,,,,,0,,50.7,1,169.3,1,,,,,3080,3,,0,,0,,,19013.748369,58753.816038,,7,3,1,,4,4,10,10,,,17.700001,2,132
83834,,United States of America,,,2,12267.52054,1,69,,,,,0,,87.7,1,176.4,1,28.200001,,3,,240,1,2,0,,0,,,8812.789640000001,6645.47302,3,,4,1,5,1,1,3,3,,,,2,131
83835,,United States of America,,,2,15711.013737,2,13,,,,,0,,79.40000000000001,1,163.2,1,,,,,,,,0,,0,,,10497.663041,8761.634996999999,,6,4,1,,4,4,2,2,,,29.799999,2,131
83836,,United States of America,,,1,10403.834454,2,18,,,,,0,,68.59999999999999,1,156.5,1,,,,,2640,2,5,0,,0,,,8099.62612,7276.988363,,9,1,1,,6,6,11,11,,,28,1,133
83837,,United States of America,,,1,16341.919117,2,45,,,,,0,,77.5,1,148.3,1,35.200001,,4,,,,3,0,,0,,,33182.48325,37935.410111,2,,1,2,1,7,7,11,11,,,,1,133
83838,,United States of America,,,1,10723.808638,2,8,,,,,0,,34.3,1,134.1,1,,,,,,,,0,,0,,,25710.802001,30877.973201,,1,1,1,,6,6,2,2,,,19.1,1,128
83839,,United States of America,,,2,86052.50232,1,13,,,,,0,,53.8,1,171.6,1,,,,,1980,2,,0,,0,,,55214.832828,46520.787346,,6,3,1,,4,4,12,12,,,18.299999,2,124
83840,,United States of America,,,2,6011.29296,2,.8333333333333334,,,,,3,,7.3,1,,,,,,,,,,0,,0,,,11410.641686,15421.648947,,,1,1,,4,3,8,4,70.8,1,,1,122
83841,,United States of America,,,1,15451.603797,1,13,,,,,0,,55.9,1,164.6,1,,,,,,,,0,,0,,,13120.218012,11212.489802,,7,6,2,,4,4,12,12,,,20.6,2,122
83842,,United States of America,,,2,25928.101863,1,1.416666666666667,,,,,0,,,,,,,,,,,,,0,,0,,,15774.754835,12465.429121,,,3,1,,3,3,11,11,,,,2,124
83843,,United States of America,,,1,18517.464588,1,80,,,,,0,,78.3,1,179.7,1,24.200001,,2,,,,2,0,,0,,,27955.149229,28219.088059,4,,3,1,1,2,2,8,8,,,,1,128
83844,,United States of America,,,1,33012.516984,1,27,,,,,0,,68.90000000000001,1,172.8,1,23.1,,2,,480,1,5,0,,0,,,20533.158386,0,2,,1,2,6,5,5,7,7,,,,1,121
83845,,United States of America,,,2,22031.510992,2,44,,,,0,0,,133.3,1,171.5,1,45.299999,,4,,,,1,0,,0,,,13204.976437,10486.202058,1,,4,1,5,7,7,9,9,,,,2,124
83847,,United States of America,,,1,86016.324929,1,18,,,,,0,,71.2,1,185,1,,,,,6960,3,3,0,,0,,,55191.619923,46501.229511,,10,3,1,,3,3,12,12,,,20.799999,2,128
83848,,United States of America,,,1,36403.714454,1,10,,,,,0,,44.6,1,143,1,,,,,,,,0,,0,,,24740.22387,20834.363892,,4,3,1,,4,4,7,7,,,21.799999,1,125
83849,,United States of America,,,1,11258.826795,1,71,,,,,0,,80.3,1,170.6,1,27.6,,3,,380,1,1,,,3,,,5601.170785,0,4,,2,1,1,3,3,6,6,,,,1,127
83851,,United States of America,,,1,73157.086814,2,37,,,,0,0,,85.09999999999999,1,155.3,1,35.299999,,4,,19200,3,1,0,,0,,,61896.189785,50541.800405,3,,3,1,1,4,4,8,8,,,,1,120
83852,,United States of America,,,1,18895.88029,2,.4166666666666667,,,,,3,,7.2,1,,,,,,,,,,0,,0,,,11386.410427,8921.548048000001,,,3,1,,5,5,12,12,66.09999999999999,1,,2,133
83853,,United States of America,,,2,110568.780895,2,49,,,,,0,,76.09999999999999,1,166.7,1,27.4,,3,,900,2,5,0,,0,,,63031.481812,0,3,,3,1,1,3,3,12,12,,,,2,123
83854,,United States of America,,,1,26459.144642,2,46,,,,,0,,110.2,1,162.7,1,41.599998,,4,,,,5,0,,0,,,16341.574732,0,5,,1,1,1,4,4,9,9,,,,1,127
83855,,United States of America,,,1,73333.788703,2,12,,,,,0,,33.6,1,143.9,1,,,,,7180,3,,0,,0,,,153218.750045,171187.917118,,5,3,1,,4,4,7,7,,,16.200001,2,125
83856,,United States of America,,,2,48195.032625,1,30,,,,,0,,89.09999999999999,1,181.5,1,27,,3,,640,2,2,0,,0,,,90964.93496300001,100187.413653,4,,3,1,1,4,4,8,8,,,,1,130
83857,,United States of America,,,1,135210.781434,2,31,,,,0,0,,70.40000000000001,1,159,1,27.799999,,3,,11400,3,3,0,,0,,,114398.106226,93412.636088,5,,3,1,1,2,2,12,12,,,,1,130
83858,,United States of America,,,2,5650.764298,1,.4166666666666667,,,,,0,,7.5,1,,,,,,,,,,0,,0,,,4901.505816,4165.439026,,,1,1,,7,7,,,64.09999999999999,1,,1,120
83859,,United States of America,,,1,16189.903052,1,2,,,,,0,,11.8,1,88.2,1,,,,,,,,0,,0,,,11808.775174,0,,,3,1,,7,7,3,3,89.5,1,15.2,1,125
83860,,United States of America,,,1,22668.56273,1,41,,,,,0,,146.1,1,189.4,1,40.700001,,4,,,,1,0,,0,,,45100.072962,0,4,,4,1,1,4,4,12,12,,,,2,125
83863,,United States of America,,,1,25463.372657,1,35,,,,,0,,95.8,1,175.6,1,31.1,,4,,16800,3,5,0,,0,,,52069.183648,61674.631717,3,,1,2,1,5,5,11,11,,,,1,120
83864,,United States of America,,,2,15599.701949,1,4,,,,,0,,19.5,1,111.6,1,,,,,,,,0,,0,,,34783.607274,46112.825634,,,4,1,,2,2,1,1,,,15.7,1,132
83865,,United States of America,,,2,63044.869905,2,21,,,,0,0,,39.7,1,156.3,1,16.299999,,1,,480,1,1,0,,0,,,40534.044282,0,2,,3,1,5,4,4,8,8,,,,2,126
83866,,United States of America,,,2,29280.855908,1,40,,,,,0,,88,1,169.3,1,30.700001,,4,,17640,3,1,0,,0,,,58255.512427,74832.381165,4,,4,1,5,3,3,11,11,,,,1,132
83867,,United States of America,,,1,14798.442544,1,13,,,,,0,,72.3,1,173.9,1,,,,,120,1,,0,,0,,,14208.291571,12142.353442,,6,6,1,,4,4,7,7,,,23.9,2,121
83868,,United States of America,,,1,16002.500607,2,11,,,,,0,,43.2,1,145.7,1,,,,,,,,0,,0,,,11669.888253,38434.01658,,5,1,1,,4,4,12,12,,,20.4,1,121
83869,,United States of America,,,1,37505.346642,2,67,,,,,0,,61.3,1,160.2,1,23.9,,2,,840,2,1,0,,0,,,17057.428663,12765.633283,5,,3,1,3,1,1,4,4,,,,2,132
83870,,United States of America,,,2,40991.596214,1,48,,,,,0,,82.40000000000001,1,169.8,1,28.6,,3,,1680,2,2,0,,0,,,25561.428636,22036.931652,3,,1,2,1,5,5,9,9,,,,1,132
83871,,United States of America,,,1,23411.220472,2,30,,,,0,0,,53.7,1,139.9,1,27.4,,3,,3360,3,3,0,,0,,,14422.116036,46449.331133,1,,1,2,6,7,7,6,6,,,,1,120
83872,,United States of America,,,2,7738.995646,1,63,,,,,0,,67.2,1,170,1,23.299999,,2,,18600,3,5,0,,0,,,12657.793389,16479.551723,3,,1,2,2,4,4,,,,,,1,122
83873,,United States of America,,,2,44819.871091,1,4,,,,,0,,17.8,1,104.8,1,,,,,,,,0,,0,,,95051.849173,126129.078301,,,3,1,,7,7,12,12,,,16.200001,2,120
83875,,United States of America,,,2,21360.939121,2,42,,,,0,0,,91.59999999999999,1,163.1,1,34.400002,,4,,720,2,3,0,,0,,,42092.17939,0,5,,4,2,1,7,7,10,10,,,,2,130
83876,,United States of America,,,1,51541.657183,2,71,,,,,0,,61.5,1,152.7,1,26.4,,3,,,,2,3,,,,,77066.650008,92507.29839300001,3,,3,1,3,1,1,2,2,,,,2,132
83878,,United States of America,,,2,6991.939689,1,10,,,,,0,,42.2,1,151.2,1,,,,,,,,0,,0,,,16425.238106,18481.698743,,5,4,1,,7,7,13,13,,,18.5,1,123
83879,,United States of America,,,2,71929.65659300001,2,14,,,,,0,,50.3,1,150.5,1,,,,,13680,3,,0,,0,,,68017.98243600001,56822.95434,,8,3,1,,5,5,12,12,,,22.200001,2,126
83880,,United States of America,,,2,46534.060482,2,79,,,,,0,,49.7,1,143.9,1,24,,2,,96,1,5,0,,0,,,69579.13945,0,1,,3,2,1,6,6,3,3,,,,1,123
83881,,United States of America,,,1,61363.034774,2,32,,,,0,0,,63.2,1,162.7,1,23.9,,2,,1680,2,3,3,,,,,114711.346004,125272.082519,5,,3,2,1,4,4,8,8,,,,2,125
83882,,United States of America,,,1,22518.044596,2,4,,,,,0,,21,1,112.7,1,,,,,,,,0,,0,,,14386.684836,43283.311207,,,3,1,,3,3,4,4,,,16.5,1,133
83883,,United States of America,,,1,11641.228605,2,80,,,,,0,,46.7,1,152.4,1,20.1,,2,,480,1,3,4,,,,,18858.190952,24344.238251,2,,1,1,5,1,1,2,2,,,,1,128
83884,,United States of America,,,1,8113.690331,1,61,,,,,0,,62.2,1,167,1,22.299999,,2,,,,1,0,,0,,,13270.638792,17277.433092,3,,1,1,1,4,4,4,4,,,,1,127
83885,,United States of America,,,1,13606.800072,2,38,,,,0,0,,48.7,1,149.3,1,21.799999,,2,,480,1,3,0,,0,,,10238.658462,8480.072471,4,,5,2,1,4,4,11,11,,,,2,121
83886,,United States of America,,,2,18906.149564,1,74,,,,,0,,84.09999999999999,1,175.9,1,27.200001,,3,,3840,3,2,0,,0,,,28541.932935,34552.870199,5,,3,1,1,2,2,6,6,,,,2,123
83887,,United States of America,,,2,27815.239396,2,51,,,,,0,,51.4,1,149.3,1,23.1,,2,,1200,2,3,0,,0,,,16671.556524,13239.047503,2,,4,2,1,6,6,,,,,,1,119
83889,,United States of America,,,2,170717.940863,1,26,,,,,0,,77.7,1,178.7,1,24.299999,,2,,480,1,2,0,,0,,,322218.816791,354886.967136,5,,3,1,6,2,1,11,8,,,,1,132
83890,,United States of America,,,2,7587.102082,2,18,,,,,0,,50.5,1,157.4,1,,,,,80,1,3,0,,0,,,20977.752131,23773.32114,,13,5,1,,5,5,6,6,,,20.4,1,119
83891,,United States of America,,,1,97546.39674900001,2,54,,,,,0,,109.5,1,167.9,1,38.799999,,4,,,,3,0,,0,,,55607.865826,44200.212232,4,,3,1,5,1,1,9,9,,,,1,125
83892,,United States of America,,,2,7943.351478,2,2,,,,,0,,11,1,84.59999999999999,1,,,,,,,,0,,0,,,17542.436332,19227.64995,,,6,1,,4,4,4,4,83.5,1,15.4,2,131
83894,,United States of America,,,1,14849.610234,1,60,,,,,0,,58.9,1,173.1,1,19.700001,,2,,6720,3,1,0,,0,,,10667.721387,8044.224083,3,,4,1,1,7,7,8,8,,,,2,133
83895,,United States of America,,,2,38906.088612,2,80,,,,,0,,56.2,1,154.5,1,23.5,,2,,,,5,0,,0,,,17694.486,13242.401529,3,,3,1,2,3,3,4,4,,,,1,130
83896,,United States of America,,,1,10149.509781,2,9,,,,,0,,36.9,1,133.7,1,,,,,,,,0,,0,,,7401.571034,6646.544931,,3,2,1,,5,5,5,5,,,20.6,1,120
83897,,United States of America,,,1,68402.551901,2,29,,,,0,0,,79.09999999999999,1,160.6,1,30.700001,,4,,3360,3,2,0,,0,,,43978.710273,35911.14743,5,,3,1,6,2,1,7,5,,,,2,121
83898,,United States of America,,,1,197997.70503,1,55,,,,,0,,86,1,185.4,1,25,,3,,7960,3,2,0,,0,,,374666.673618,401684.941278,4,,3,1,1,3,3,8,8,,,,2,127
83899,,United States of America,,,2,41361.395933,1,27,,,,,0,,75.3,1,177,1,24,,2,,3920,3,3,5,Low carbohydrate diet,,,,78066.897896,85981.70927399999,1,,3,1,1,2,2,6,6,,,,1,131
83900,,United States of America,,,1,38992.143171,2,52,,,,,0,,73,1,165.9,1,26.5,,3,,2320,2,1,0,,0,,,73078.53384600001,0,5,,3,1,3,1,1,3,3,,,,1,125
83902,,United States of America,,,2,180562.622596,1,49,,,,,0,,90.7,1,188.5,1,25.5,,3,,900,2,3,0,,0,,,154639.603966,454649.930156,4,,3,1,1,2,2,12,12,,,,1,132
83903,,United States of America,,,1,30052.523171,2,47,,,,,0,,110.2,1,161.1,1,42.5,,4,,,,2,5,Sugar free/Low sugar diet,2,,,20367.261994,16173.843675,4,,4,1,1,3,3,7,7,,,,2,128
83905,,United States of America,,,2,11168.380239,1,9,,,,,0,,54.7,1,139.3,1,,,,,,,,0,,0,,,9298.21508,8420.984188,,4,2,1,,7,7,9,9,,,28.200001,1,123
83908,,United States of America,,,2,22812.965188,1,51,,,,,0,,70.5,1,169.1,1,24.700001,,2,,,,5,0,,0,,,45387.367814,48614.737773,3,,4,2,1,2,1,6,4,,,,2,120
83909,,United States of America,,,1,41791.705485,2,49,,,,,0,,95.7,1,159.1,1,37.799999,,4,,2640,2,1,0,,0,,,26938.502687,21412.214231,4,,3,1,1,3,3,,,,,,2,131
83910,,United States of America,,,2,30870.783863,1,37,,,,,0,,73.2,1,178.9,1,22.9,,2,,6960,3,1,0,,0,,,26371.04613,0,3,,3,1,6,2,2,10,10,,,,2,126