id,hh_id,country,sec_area,tert_area,round,smpl_weight,sex,age,edc_level,edc,residence,preg_lact,breastfeeding,hh_head,wgt,wgt_method,hgt,hgt_method,bmi_adults,bmi_children,bmi_cat,misrep,pa,pa_cat,smok,special_diet,special_diet_other,clin_diet,clin_diet_other,note,bmi_chld
200635224,,Sweden,,,,1,2,73,,,,0,,,55,2,160,2,21.484375,,2,,,,,0,,0,,,
200635225,,Sweden,,,,1,2,73,,,,0,,,62,2,164,2,23.051754,,2,,,,,0,,0,,,
200635226,,Sweden,,,,1,1,73,,,,0,,,75,2,171,2,25.648918,,3,,,,,0,,0,,,
200635227,,Sweden,,,,1,2,73,,,,0,,,78.400002,2,169,2,27.45002,,3,,,,,0,,0,,,
200635228,,Sweden,,,,1,2,72,,,,,,,70,2,162,2,26.672764,,3,,,,,0,,0,,,
200635229,,Sweden,,,,1,2,72,,,,0,,,68,2,168,2,24.09297,,2,,,,,0,,0,,,
200635230,,Sweden,,,,1,2,73,,,,0,,,53,2,160,2,20.703125,,2,,,,,0,,0,,,
200635231,,Sweden,,,,1,2,68,,,,0,,,66.631577,3,163.6909,3,24.867435,,2,,,,,0,,0,,,
200635232,,Sweden,,,,1,1,64,,,,0,,,66,2,163,2,24.840981,,2,,,,,0,,0,,,
200635233,,Sweden,,,,1,1,60,,,,0,,,71,2,167,2,25.458065,,3,,,,,0,,0,,,
200635234,,Sweden,,,,1,1,61,,,,0,,,92,2,183,2,27.471706,,3,,,,,0,,0,,,
200635235,,Sweden,,,,1,1,57,,,,0,,,86,2,182,2,25.963047,,3,,,,,0,,0,,,
200635236,,Sweden,,,,1,2,49,,,,0,,,68,2,176,2,21.952478,,2,,,,,0,,0,,,
200635237,,Sweden,,,,1,1,17,,,,0,,,77,2,178,2,,,,,,,,0,,0,,,24.302486
200635238,,Sweden,,,,1,2,54,,,,0,,,73,2,159,2,28.875441,,3,,,,,0,,0,,,
200635239,,Sweden,,,,1,2,49,,,,0,,,70,2,170,2,24.221453,,2,,,,,0,,0,,,
200635240,,Sweden,,,,1,1,53,,,,0,,,105,2,182,2,31.69907,,4,,,,,0,,0,,,
200635241,,Sweden,,,,1,2,52,,,,0,,,60,2,167,2,21.513859,,2,,,,,0,,0,,,
200635242,,Sweden,,,,1,2,53,,,,0,,,66,2,164,2,24.538965,,2,,,,,0,,0,,,
200635243,,Sweden,,,,1,1,50,,,,0,,,73,2,183,2,21.798203,,2,,,,,0,,0,,,
200635244,,Sweden,,,,1,1,48,,,,0,,,70,2,178,2,22.09317,,2,,,,,0,,0,,,
200635245,,Sweden,,,,1,2,47,,,,0,,,79,2,168,2,27.990362,,3,,,,,0,,0,,,
200635246,,Sweden,,,,1,1,48,,,,0,,,87,2,172,2,29.407787,,3,,,,,0,,0,,,
200635247,,Sweden,,,,1,2,46,,,,0,,,80.5,2,157,2,32.658527,,4,,,,,0,,0,,,
200635248,,Sweden,,,,1,2,43,,,,0,,,62,2,170,2,21.453287,,2,,,,,0,,0,,,
200635249,,Sweden,,,,1,2,45,,,,0,,,59,2,168,2,20.904196,,2,,,,,0,,0,,,
200635250,,Sweden,,,,1,1,42,,,,0,,,94,2,184,2,27.76465,,3,,,,,0,,0,,,
200635251,,Sweden,,,,1,1,41,,,,0,,,90,2,183,2,26.874496,,3,,,,,0,,0,,,
200635252,,Sweden,,,,1,2,34,,,,1,,,86,2,177,2,27.450605,,3,,,,,0,,0,,,
200635253,,Sweden,,,,1,1,38,,,,0,,,85,2,172,2,28.731747,,3,,,,,0,,0,,,
200635254,,Sweden,,,,1,1,38,,,,0,,,65,2,175,2,21.224489,,2,,,,,0,,0,,,
200635255,,Sweden,,,,1,2,34,,,,0,,,72,2,172,2,24.337481,,2,,,,,0,,0,,,
200635256,,Sweden,,,,1,2,36,,,,0,,,53,2,172,2,17.915089,,1,,,,,0,,0,,,
200635257,,Sweden,,,,1,1,35,,,,0,,,84,2,184,2,24.810965,,2,,,,,0,,0,,,
200635258,,Sweden,,,,1,1,35,,,,2,,,80.861092,3,179.49901,3,25.096636,,3,,,,,0,,0,,,
200635259,,Sweden,,,,1,2,32,,,,,,,60,2,173,2,20.047445,,2,,,,,0,,0,,,
200635260,,Sweden,,,,1,2,26,,,,0,,,100,2,172,2,33.802055,,4,,,,,0,,0,,,
200635261,,Sweden,,,,1,1,28,,,,0,,,70,2,180,2,21.604939,,2,,,,,0,,0,,,
200635262,,Sweden,,,,1,2,28,,,,0,,,73,2,168,2,25.864513,,3,,,,,0,,0,,,
200635263,,Sweden,,,,1,1,28,,,,0,,,82,2,191,2,22.477453,,2,,,,,0,,0,,,
200635264,,Sweden,,,,1,1,26,,,,0,,,80,2,182,2,24.151672,,2,,,,,0,,0,,,
200635265,,Sweden,,,,1,2,25,,,,0,,,66.631577,3,172,2,22.522842,,2,,,,,0,,0,,,
200635266,,Sweden,,,,1,1,25,,,,0,,,65,2,178,2,20.515087,,2,,,,,0,,0,,,
200635267,,Sweden,,,,1,1,22,,,,0,,,72,2,175,2,23.510204,,2,,,,,0,,0,,,
200635268,,Sweden,,,,1,2,19,,,,0,,,62,2,179,2,,,,,,,,0,,0,,,19.350208
200635269,,Sweden,,,,1,1,73,,,,0,,,67.5,2,164,2,25.096668,,3,,,,,0,,0,,,
200635270,,Sweden,,,,1,2,57,,,,0,,,65,2,170,2,22.49135,,2,,,,,0,,0,,,
200635271,,Sweden,,,,1,1,72,,,,0,,,65,2,168,2,23.030045,,2,,,,,0,,0,,,
200635272,,Sweden,,,,1,2,72,,,,0,,,68,2,167,2,24.382374,,2,,,,,0,,0,,,
200635273,,Sweden,,,,1,2,70,,,,0,,,66,2,158,2,26.43807,,3,,,,,0,,0,,,
200635274,,Sweden,,,,1,1,69,,,,,,,67,2,178,2,21.14632,,2,,,,,0,,0,,,
200635275,,Sweden,,,,1,2,63,,,,0,,,78,2,164,2,29.000595,,3,,,,,0,,0,,,
200635276,,Sweden,,,,1,1,68,,,,0,,,88,2,175,2,28.734694,,3,,,,,0,,0,,,
200635277,,Sweden,,,,1,1,18,,,,0,,,60,2,193,2,,,,,,,,0,,0,,,16.107815
200635278,,Sweden,,,,1,2,57,,,,0,,,59,2,163,2,22.206331,,2,,,,,0,,0,,,
200635279,,Sweden,,,,1,2,58,,,,0,,,76,2,160,2,29.6875,,3,,,,,0,,0,,,
200635280,,Sweden,,,,1,2,58,,,,0,,,80,2,170,2,27.681662,,3,,,,,0,,0,,,
200635281,,Sweden,,,,1,1,55,,,,0,,,70,2,174,2,23.120625,,2,,,,,0,,0,,,
200635282,,Sweden,,,,1,2,45,,,,0,,,73,2,159,2,28.875441,,3,,,,,0,,0,,,
200635283,,Sweden,,,,1,2,53,,,,0,,,70,2,160,2,27.34375,,3,,,,,0,,0,,,
200635284,,Sweden,,,,1,1,52,,,,0,,,82,2,180,2,25.308641,,3,,,,,0,,0,,,
200635285,,Sweden,,,,1,1,46,,,,0,,,65,2,180,2,20.061728,,2,,,,,0,,6,Diet related to health condition (condition unspecified),,
200635286,,Sweden,,,,1,2,45,,,,0,,,55,2,165,2,20.202021,,2,,,,,0,,0,,,
200635287,,Sweden,,,,1,1,45,,,,0,,,78,2,181,2,23.808798,,2,,,,,0,,0,,,
200635288,,Sweden,,,,1,1,45,,,,0,,,85,2,183,2,25.381468,,3,,,,,0,,0,,,
200635289,,Sweden,,,,1,2,44,,,,0,,,63,2,171,2,21.545092,,2,,,,,0,,0,,,
200635290,,Sweden,,,,1,2,39,,,,0,,,65,2,176,2,20.983988,,2,,,,,0,,0,,,
200635291,,Sweden,,,,1,2,42,,,,0,,,60,2,176,2,19.369835,,2,,,,,0,,0,,,
200635292,,Sweden,,,,1,1,39,,,,0,,,78,2,178,2,24.618103,,2,,,,,0,,0,,,
200635293,,Sweden,,,,1,1,40,,,,0,,,63,2,168,2,22.321428,,2,,,,,0,,0,,,
200635294,,Sweden,,,,1,1,38,,,,0,,,78,2,179,2,24.343809,,2,,,,,0,,0,,,
200635295,,Sweden,,,,1,2,37,,,,0,,,93,2,155,2,38.709679,,4,,,,,0,,0,,,
200635296,,Sweden,,,,1,2,31,,,,0,,,74,2,176,2,23.889463,,2,,,,,0,,0,,,
200635297,,Sweden,,,,1,2,32,,,,1,,,69,2,171,2,23.597004,,2,,,,,0,,0,,,
200635298,,Sweden,,,,1,1,34,,,,0,,,90,2,186,2,26.014568,,3,,,,,0,,0,,,
200635299,,Sweden,,,,1,2,32,,,,0,,,64,2,169,2,22.408178,,2,,,,,0,,0,,,
200635300,,Sweden,,,,1,1,32,,,,0,,,92,2,185,2,26.880936,,3,,,,,0,,0,,,
200635301,,Sweden,,,,1,2,32,,,,0,,,88,2,169,2,30.811247,,4,,,,,0,,0,,,
200635302,,Sweden,,,,1,2,30,,,,2,,,56,2,170,2,19.377163,,2,,,,,0,,0,,,
200635303,,Sweden,,,,1,1,28,,,,0,,,68,2,188,2,19.239475,,2,,,,,0,,0,,,
200635304,,Sweden,,,,1,2,22,,,,0,,,48,2,168,2,17.006804,,1,,,,,0,,0,,,
200635305,,Sweden,,,,1,1,27,,,,0,,,83,2,176,2,26.794937,,3,,,,,1,,0,,,
200635306,,Sweden,,,,1,2,25,,,,0,,,70,2,173,2,23.388687,,2,,,,,0,,0,,,
200635307,,Sweden,,,,1,2,24,,,,0,,,57,2,164,2,21.192743,,2,,,,,0,,0,,,
200635308,,Sweden,,,,1,2,24,,,,0,,,80,2,172,2,27.041645,,3,,,,,0,,0,,,
200635309,,Sweden,,,,1,1,23,,,,0,,,76,2,182,2,22.944088,,2,,,,,0,,0,,,
200635310,,Sweden,,,,1,2,21,,,,0,,,58.900002,2,172,2,19.90941,,2,,,,,0,,0,,,
200635311,,Sweden,,,,1,2,20,,,,0,,,60,2,168,2,21.258503,,2,,,,,0,,0,,,
200635312,,Sweden,,,,1,2,21,,,,0,,,59,2,166.44165,3,21.297468,,2,,,,,0,,0,,,
200635313,,Sweden,,,,1,2,70,,,,,,,61,2,162,2,23.243408,,2,,,,,0,,0,,,
200635314,,Sweden,,,,1,1,72,,,,0,,,90,2,185,2,26.296566,,3,,,,,0,,0,,,
200635315,,Sweden,,,,1,1,68,,,,0,,,65,2,178,2,20.515087,,2,,,,,0,,0,,,
200635316,,Sweden,,,,1,1,65,,,,0,,,87,2,186,2,25.147415,,3,,,,,0,,0,,,
200635317,,Sweden,,,,1,2,69,,,,0,,,79.400002,2,160,2,31.015625,,4,,,,,0,,0,,,
200635318,,Sweden,,,,1,2,55,,,,0,,,53,2,160,2,20.703125,,2,,,,,0,,0,,,
200635319,,Sweden,,,,1,1,63,,,,,,,72,2,189,2,20.15621,,2,,,,,0,,0,,,
200635320,,Sweden,,,,1,2,17,,,,0,,,57,2,168,2,,,,,,,,0,,0,,,20.195578
200635321,,Sweden,,,,1,1,58,,,,,,,82,2,173,2,27.398176,,3,,,,,0,,0,,,
200635322,,Sweden,,,,1,2,62,,,,0,,,78,2,170,2,26.98962,,3,,,,,0,,0,,,
200635323,,Sweden,,,,1,2,57,,,,0,,,78,2,172,2,26.365602,,3,,,,,0,,0,,,
200635324,,Sweden,,,,1,1,57,,,,,,,73,2,170,2,25.259516,,3,,,,,0,,0,,,
200635325,,Sweden,,,,1,2,49,,,,0,,,63,2,162,2,24.005487,,2,,,,,0,,0,,,
200635326,,Sweden,,,,1,2,54,,,,0,,,57,2,163,2,21.453573,,2,,,,,0,,0,,,
200635327,,Sweden,,,,1,2,50,,,,0,,,73,2,156,2,29.996714,,3,,,,,0,,0,,,
200635328,,Sweden,,,,1,1,52,,,,,,,103,2,190,2,28.531857,,3,,,,,0,,0,,,
200635329,,Sweden,,,,1,2,50,,,,0,,,73,2,159,2,28.875441,,3,,,,,0,,0,,,
200635330,,Sweden,,,,1,2,51,,,,0,,,75,2,170,2,25.951557,,3,,,,,0,,0,,,
200635331,,Sweden,,,,1,2,44,,,,0,,,55,2,158,2,22.031725,,2,,,,,0,,0,,,
200635332,,Sweden,,,,1,2,49,,,,0,,,68,2,171,2,23.255018,,2,,,,,0,,0,,,
200635333,,Sweden,,,,1,2,45,,,,0,,,69,2,161,2,26.619343,,3,,,,,0,,0,,,
200635334,,Sweden,,,,1,2,45,,,,0,,,53,2,160,2,20.703125,,2,,,,,0,,0,,,
200635335,,Sweden,,,,1,1,18,,,,,,,59.5,2,180,2,,,,,,,,0,,0,,,18.364197
200635336,,Sweden,,,,1,2,43,,,,0,,,57,2,161,2,21.989893,,2,,,,,0,,0,,,
200635337,,Sweden,,,,1,2,45,,,,0,,,72,2,170,2,24.913494,,2,,,,,0,,0,,,
200635338,,Sweden,,,,1,2,17,,,,0,,,58,2,173,2,,,,,,,,0,,0,,,19.379198
200635339,,Sweden,,,,1,2,45,,,,0,,,56,2,161,2,21.604105,,2,,,,,0,,0,,,
200635340,,Sweden,,,,1,1,43,,,,,,,110,2,178,2,34.717838,,4,,,,,0,,0,,,
200635341,,Sweden,,,,1,2,40,,,,0,,,68,2,165,2,24.977043,,2,,,,,0,,0,,,
200635342,,Sweden,,,,1,1,39,,,,,,,90,2,176,2,29.054752,,3,,,,,0,,0,,,
200635343,,Sweden,,,,1,2,51,,,,0,,,57,2,168,2,20.195578,,2,,,,,0,,0,,,
200635344,,Sweden,,,,1,2,37,,,,0,,,50,2,162,2,19.051973,,2,,,,,0,,0,,,
200635345,,Sweden,,,,1,2,32,,,,2,,,76,2,172,2,25.689562,,3,,,,,0,,0,,,
200635346,,Sweden,,,,1,2,37,,,,0,,,52,2,158,2,20.829996,,2,,,,,0,,0,,,
200635347,,Sweden,,,,1,2,36,,,,0,,,80,2,180,2,24.691359,,2,,,,,0,,0,,,
200635348,,Sweden,,,,1,2,43,,,,0,,,68,2,158,2,27.239225,,3,,,,,0,,0,,,
200635349,,Sweden,,,,1,1,35,,,,,,,78,2,183,2,23.291229,,2,,,,,0,,0,,,
200635350,,Sweden,,,,1,1,35,,,,,,,82,2,175,2,26.775511,,3,,,,,0,,0,,,
200635351,,Sweden,,,,1,2,34,,,,0,,,61,2,167,2,21.872423,,2,,,,,0,,0,,,
200635352,,Sweden,,,,1,2,37,,,,2,,,78,2,167,2,27.968016,,3,,,,,0,,0,,,
200635353,,Sweden,,,,1,1,33,,,,,,,169,2,174,2,55.81979,,4,,,,,0,,0,,,
200635354,,Sweden,,,,1,1,32,,,,,,,69,2,187,2,19.731762,,2,,,,,0,,0,,,
200635355,,Sweden,,,,1,1,32,,,,,,,73,2,175,2,23.836735,,2,,,,,0,,0,,,
200635356,,Sweden,,,,1,1,32,,,,,,,60,2,175,2,19.591837,,2,,,,,0,,0,,,
200635357,,Sweden,,,,1,1,30,,,,,,,96,2,182,2,28.982006,,3,,,,,0,,0,,,
200635358,,Sweden,,,,1,2,30,,,,0,,,60,2,165,2,22.038567,,2,,,,,1,,0,,,
200635359,,Sweden,,,,1,2,29,,,,0,,,100,2,167,2,35.85643,,4,,,,,0,,0,,,
200635360,,Sweden,,,,1,1,28,,,,,,,115,2,186,2,33.240837,,4,,,,,0,,0,,,
200635361,,Sweden,,,,1,2,28,,,,0,,,55,2,172,2,18.591131,,2,,,,,0,,0,,,
200635362,,Sweden,,,,1,2,28,,,,0,,,72,2,174,2,23.781214,,2,,,,,0,,0,,,
200635363,,Sweden,,,,1,1,27,,,,,,,87,2,184,2,25.697069,,3,,,,,0,,0,,,
200635364,,Sweden,,,,1,1,27,,,,,,,85,2,183,2,25.381468,,3,,,,,0,,0,,,
200635365,,Sweden,,,,1,2,26,,,,0,,,51,2,164,2,18.961927,,2,,,,,0,,0,,,
200635366,,Sweden,,,,1,2,24,,,,0,,,84,2,167,2,30.119402,,4,,,,,0,,0,,,
200635367,,Sweden,,,,1,1,23,,,,,,,94,2,190,2,26.03878,,3,,,,,0,,0,,,
200635368,,Sweden,,,,1,1,22,,,,,,,75,2,173,2,25.059307,,3,,,,,0,,0,,,
200635369,,Sweden,,,,1,1,22,,,,,,,68,2,170,2,23.529411,,2,,,,,0,,0,,,
200635370,,Sweden,,,,1,1,21,,,,,,,88,2,200,2,22,,2,,,,,0,,0,,,
200635371,,Sweden,,,,1,2,21,,,,0,,,57,2,160,2,22.265625,,2,,,,,0,,0,,,
200635372,,Sweden,,,,1,2,73,,,,0,,,63,2,163,2,23.711845,,2,,,,,0,,0,,,
200635373,,Sweden,,,,1,2,74,,,,0,,,58,2,160,2,22.65625,,2,,,,,0,,0,,,
200635374,,Sweden,,,,1,1,72,,,,0,,,78,2,167,2,27.968016,,3,,,,,0,,0,,,
200635375,,Sweden,,,,1,1,65,,,,0,,,85,2,180,2,26.234568,,3,,,,,0,,0,,,
200635376,,Sweden,,,,1,2,61,,,,0,,,66,2,157,2,26.775934,,3,,,,,0,,0,,,
200635377,,Sweden,,,,1,2,43,,,,0,,,61,2,176,2,19.692665,,2,,,,,0,,0,,,
200635378,,Sweden,,,,1,2,56,,,,0,,,60,2,158,2,24.034611,,2,,,,,0,,0,,,
200635379,,Sweden,,,,1,1,58,,,,0,,,107,2,200,2,26.75,,3,,,,,0,,0,,,
200635380,,Sweden,,,,1,2,54,,,,,,,85,2,173,2,28.400547,,3,,,,,0,,0,,,
200635381,,Sweden,,,,1,2,52,,,,0,,,78,2,167,2,27.968016,,3,,,,,0,,0,,,
200635382,,Sweden,,,,1,2,52,,,,0,,,60,2,168,2,21.258503,,2,,,,,0,,0,,,
200635383,,Sweden,,,,1,2,53,,,,0,,,50,2,155,2,20.811655,,2,,,,,0,,0,,,
200635384,,Sweden,,,,1,1,53,,,,0,,,85,2,187,2,24.307243,,2,,,,,0,,0,,,
200635385,,Sweden,,,,1,1,53,,,,,,,89,2,178,2,28.089888,,3,,,,,0,,0,,,
200635386,,Sweden,,,,1,2,47,,,,,,,58,2,157,2,23.530367,,2,,,,,0,,0,,,
200635387,,Sweden,,,,1,1,48,,,,,,,57,2,174,2,18.826794,,2,,,,,0,,0,,,
200635388,,Sweden,,,,1,1,49,,,,,,,94,2,188,2,26.595745,,3,,,,,0,,0,,,
200635389,,Sweden,,,,1,2,39,,,,,,,59,2,157,2,23.936062,,2,,,,,0,,0,,,
200635390,,Sweden,,,,1,2,40,,,,0,,,57,2,167,2,20.438166,,2,,,,,0,,0,,,
200635391,,Sweden,,,,1,1,47,,,,0,,,78,2,167,2,27.968016,,3,,,,,0,,0,,,
200635392,,Sweden,,,,1,1,44,,,,0,,,78,2,178,2,24.618103,,2,,,,,0,,0,,,
200635393,,Sweden,,,,1,1,17,,,,,,,60,2,177,2,,,,,,,,0,,0,,,19.151585
200635394,,Sweden,,,,1,2,41,,,,,,,67,2,162,2,25.529644,,3,,,,,0,,0,,,
200635395,,Sweden,,,,1,1,42,,,,0,,,86,2,178,2,27.143038,,3,,,,,0,,0,,,
200635396,,Sweden,,,,1,2,38,,,,,,,67,2,168,2,23.738663,,2,,,,,0,,0,,,
200635397,,Sweden,,,,1,1,39,,,,0,,,79,2,174,2,26.093275,,3,,,,,0,,0,,,
200635398,,Sweden,,,,1,2,32,,,,,,,69,2,165,2,25.344353,,3,,,,,0,,0,,,
200635399,,Sweden,,,,1,1,36,,,,0,,,77,2,189,2,21.555948,,2,,,,,0,,0,,,
200635400,,Sweden,,,,1,2,33,,,,,,,105,2,169,2,36.76342,,4,,,,,0,,0,,,
200635401,,Sweden,,,,1,2,33,,,,2,,,49,2,158,2,19.628265,,2,,,,,0,,0,,,
200635402,,Sweden,,,,1,2,33,,,,0,,,59,2,164,2,21.936348,,2,,,,,0,,0,,,
200635403,,Sweden,,,,1,1,32,,,,0,,,67,2,176,2,21.629648,,2,,,,,0,,0,,,
200635404,,Sweden,,,,1,2,29,,,,,,,79,2,177,2,25.216253,,3,,,,,0,,0,,,
200635405,,Sweden,,,,1,2,29,,,,0,,,64,2,176,2,20.661158,,2,,,,,0,,0,,,
200635406,,Sweden,,,,1,2,30,,,,2,,,84,2,170,2,29.065744,,3,,,,,0,,0,,,
200635407,,Sweden,,,,1,2,28,,,,0,,,49,2,162,2,18.670935,,2,,,,,0,,0,,,
200635408,,Sweden,,,,1,1,26,,,,0,,,88,2,182,2,26.566839,,3,,,,,0,,0,,,
200635409,,Sweden,,,,1,2,24,,,,0,,,49,2,161,2,18.903591,,2,,,,,0,,0,,,
200635410,,Sweden,,,,1,2,23,,,,,,,60,2,162,2,22.862368,,2,,,,,0,,0,,,
200635411,,Sweden,,,,1,1,22,,,,0,,,83,2,177,2,26.493025,,3,,,,,0,,0,,,
200635412,,Sweden,,,,1,1,21,,,,0,,,65,2,170,2,22.49135,,2,,,,,0,,0,,,
200635413,,Sweden,,,,1,1,21,,,,,,,73,2,178,2,23.04002,,2,,,,,0,,0,,,
200635414,,Sweden,,,,1,1,21,,,,,,,55,2,170,2,19.031141,,2,,,,,0,,0,,,
200635415,,Sweden,,,,1,1,74,,,,,,,99,2,186,2,28.616026,,3,,,,,0,,0,,,
200635416,,Sweden,,,,1,1,72,,,,0,,,73,2,170,2,25.259516,,3,,,,,0,,0,,,
200635417,,Sweden,,,,1,2,68,,,,,,,79,2,166,2,28.668892,,3,,,,,0,,0,,,
200635418,,Sweden,,,,1,1,66,,,,,,,71,2,181,2,21.67211,,2,,,,,0,,0,,,
200635419,,Sweden,,,,1,1,65,,,,0,,,87,2,176,2,28.08626,,3,,,,,0,,0,,,
200635420,,Sweden,,,,1,1,65,,,,,,,100,2,173,2,33.412411,,4,,,,,0,,0,,,
200635421,,Sweden,,,,1,2,65,,,,,,,50,2,158,2,20.028841,,2,,,,,0,,0,,,
200635422,,Sweden,,,,1,1,64,,,,,,,62,2,171,2,21.203106,,2,,,,,0,,0,,,
200635423,,Sweden,,,,1,2,64,,,,0,,,59,2,155,2,24.557753,,2,,,,,0,,0,,,
200635424,,Sweden,,,,1,2,56,,,,,,,61,2,168,2,21.612812,,2,,,,,0,,0,,,
200635425,,Sweden,,,,1,2,54,,,,0,,,60,2,167,2,21.513859,,2,,,,,0,,0,,,
200635426,,Sweden,,,,1,1,57,,,,0,,,120,2,178,2,37.874004,,4,,,,,0,,0,,,
200635427,,Sweden,,,,1,2,58,,,,0,,,55,2,161,2,21.218317,,2,,,,,0,,0,,,
200635428,,Sweden,,,,1,2,59,,,,,,,73,2,169,2,25.55933,,3,,,,,0,,0,,,
200635429,,Sweden,,,,1,1,55,,,,,,,88,2,180,2,27.160494,,3,,,,,0,,0,,,
200635430,,Sweden,,,,1,1,54,,,,0,,,75,2,180,2,23.148148,,2,,,,,0,,0,,,
200635431,,Sweden,,,,1,2,53,,,,,,,80,2,170,2,27.681662,,3,,,,,0,,0,,,
200635432,,Sweden,,,,1,1,53,,,,,,,89,2,182,2,26.868736,,3,,,,,0,,0,,,
200635433,,Sweden,,,,1,1,53,,,,0,,,80,2,171,2,27.358845,,3,,,,,0,,0,,,
200635434,,Sweden,,,,1,1,52,,,,,,,78,2,165,2,28.650137,,3,,,,,0,,0,,,
200635435,,Sweden,,,,1,2,53,,,,,,,78,2,173,2,26.06168,,3,,,,,0,,0,,,
200635436,,Sweden,,,,1,2,35,,,,,,,100,2,172,2,33.802055,,4,,,,,0,,0,,,
200635437,,Sweden,,,,1,1,18,,,,0,,,67,2,178,2,,,,,,,,0,,0,,,21.14632
200635438,,Sweden,,,,1,2,50,,,,0,,,70,2,163,2,26.346495,,3,,,,,0,,0,,,
200635439,,Sweden,,,,1,1,48,,,,0,,,75,2,189,2,20.996054,,2,,,,,0,,0,,,
200635440,,Sweden,,,,1,1,17,,,,0,,,80.861092,3,178,3,,,,,,,,0,,0,,,25.521112
200635441,,Sweden,,,,1,2,44,,,,,,,56,2,159,2,22.151022,,2,,,,,0,,0,,,
200635442,,Sweden,,,,1,1,45,,,,0,,,90,2,190,2,24.930748,,2,,,,,0,,0,,,
200635443,,Sweden,,,,1,2,44,,,,0,,,54,2,170,2,18.685122,,2,,,,,0,,0,,,
200635444,,Sweden,,,,1,1,41,,,,,,,84,2,171,2,28.726788,,3,,,,,0,,0,,,
200635445,,Sweden,,,,1,1,40,,,,0,,,80.861092,3,179.49901,3,25.096636,,3,,,,,0,,0,,,
200635446,,Sweden,,,,1,2,37,,,,,,,60,2,164,2,22.308149,,2,,,,,0,,0,,,
200635447,,Sweden,,,,1,2,37,,,,0,,,75,2,173,2,25.059307,,3,,,,,0,,0,,,
200635448,,Sweden,,,,1,1,36,,,,0,,,80.861092,3,176,2,26.104433,,3,,,,,0,,0,,,
200635449,,Sweden,,,,1,2,30,,,,,,,60,2,159,2,23.733238,,2,,,,,0,,0,,,
200635450,,Sweden,,,,1,2,24,,,,0,,,74,2,170,2,25.605536,,3,,,,,0,,0,,,
200635451,,Sweden,,,,1,2,29,,,,2,,,63,2,168,2,22.321428,,2,,,,,0,,0,,,
200635452,,Sweden,,,,1,1,30,,,,0,,,82,2,180,2,25.308641,,3,,,,,0,,0,,,
200635453,,Sweden,,,,1,2,28,,,,0,,,58,2,161,2,22.375679,,2,,,,,0,,0,,,
200635454,,Sweden,,,,1,2,28,,,,0,,,86,2,170,2,29.757786,,3,,,,,0,,0,,,
200635455,,Sweden,,,,1,1,28,,,,0,,,78,2,175,2,25.469387,,3,,,,,0,,0,,,
200635456,,Sweden,,,,1,2,23,,,,,,,80,2,167,2,28.685144,,3,,,,,0,,0,,,
200635457,,Sweden,,,,1,2,22,,,,0,,,66.631577,3,163,2,25.078691,,3,,,,,0,,0,,,
200635458,,Sweden,,,,1,2,23,,,,0,,,84,2,183,2,25.082863,,3,,,,,0,,0,,,
200635459,,Sweden,,,,1,1,19,,,,0,,,62,2,176,2,,,,,,,,0,,0,,,20.015495
200635460,,Sweden,,,,1,2,35,,,,0,,,60,2,164,2,22.308149,,2,,,,,0,,0,,,
200635461,,Sweden,,,,1,1,64,,,,0,,,70,2,167,2,25.099501,,3,,,,,0,,0,,,
200635462,,Sweden,,,,1,1,63,,,,0,,,83,2,180,2,25.617285,,3,,,,,0,,0,,,
200635463,,Sweden,,,,1,1,62,,,,0,,,80,2,176,2,25.826447,,3,,,,,0,,0,,,
200635464,,Sweden,,,,1,1,62,,,,0,,,110,2,180,2,33.950619,,4,,,,,0,,0,,,
200635465,,Sweden,,,,1,2,62,,,,0,,,62,2,159,2,24.524345,,2,,,,,0,,0,,,
200635466,,Sweden,,,,1,1,60,,,,,,,74,2,184,2,21.857279,,2,,,,,0,,0,,,
200635467,,Sweden,,,,1,1,60,,,,0,,,82,2,178,2,25.880571,,3,,,,,0,,0,,,
200635468,,Sweden,,,,1,1,59,,,,0,,,108,2,176,2,34.865704,,4,,,,,0,,0,,,
200635469,,Sweden,,,,1,2,48,,,,0,,,78,2,165,2,28.650137,,3,,,,,0,,0,,,
200635470,,Sweden,,,,1,1,56,,,,0,,,62,2,174,2,20.478266,,2,,,,,0,,0,,,
200635471,,Sweden,,,,1,1,55,,,,0,,,64,2,163,2,24.088223,,2,,,,,0,,0,,,
200635472,,Sweden,,,,1,2,50,,,,0,,,47,2,156,2,19.312952,,2,,,,,0,,0,,,
200635473,,Sweden,,,,1,1,19,,,,0,,,57,2,168,2,,,,,,,,0,,0,,,20.195578
200635474,,Sweden,,,,1,2,51,,,,0,,,64,2,163,2,24.088223,,2,,,,,0,,0,,,
200635475,,Sweden,,,,1,2,52,,,,0,,,50,2,159,2,19.777699,,2,,,,,0,,0,,,
200635476,,Sweden,,,,1,2,52,,,,0,,,63,2,167,2,22.589552,,2,,,,,0,,0,,,
200635477,,Sweden,,,,1,1,52,,,,0,,,75,2,180,2,23.148148,,2,,,,,0,,0,,,
200635478,,Sweden,,,,1,2,50,,,,0,,,55,2,169,2,19.257029,,2,,,,,0,,0,,,
200635479,,Sweden,,,,1,1,50,,,,0,,,66,2,165,2,24.242424,,2,,,,,0,,0,,,
200635480,,Sweden,,,,1,1,49,,,,0,,,92,2,180,2,28.395061,,3,,,,,0,,0,,,
200635481,,Sweden,,,,1,1,48,,,,0,,,112,2,183,2,33.443817,,4,,,,,0,,0,,,
200635482,,Sweden,,,,1,1,47,,,,0,,,67,2,179,2,20.910707,,2,,,,,0,,0,,,
200635483,,Sweden,,,,1,2,51,,,,0,,,55,2,159,2,21.755468,,2,,,,,0,,0,,,
200635484,,Sweden,,,,1,2,45,,,,0,,,80,2,182,2,24.151672,,2,,,,,0,,0,,,
200635485,,Sweden,,,,1,2,41,,,,0,,,71,2,174,2,23.450918,,2,,,,,0,,0,,,
200635486,,Sweden,,,,1,1,44,,,,0,,,74,2,186,2,21.389755,,2,,,,,0,,0,,,
200635487,,Sweden,,,,1,2,17,,,,0,,,66.631577,3,174,2,,,,,,,,0,,0,,,22.008051
200635488,,Sweden,,,,1,2,44,,,,0,,,54,2,167,2,19.362473,,2,,,,,0,,0,,,
200635489,,Sweden,,,,1,1,43,,,,0,,,87,2,175,2,28.408163,,3,,,,,0,,0,,,
200635490,,Sweden,,,,1,1,42,,,,0,,,79,2,177,2,25.216253,,3,,,,,0,,0,,,
200635491,,Sweden,,,,1,1,41,,,,0,,,90,2,185,2,26.296566,,3,,,,,0,,0,,,
200635492,,Sweden,,,,1,1,41,,,,0,,,87,2,183,2,25.97868,,3,,,,,0,,0,,,
200635493,,Sweden,,,,1,2,41,,,,0,,,74,2,164,2,27.513386,,3,,,,,0,,0,,,
200635494,,Sweden,,,,1,1,39,,,,0,,,80,2,168,2,28.344671,,3,,,,,0,,0,,,
200635495,,Sweden,,,,1,1,39,,,,0,,,72,2,178,2,22.724403,,2,,,,,0,,0,,,
200635496,,Sweden,,,,1,1,37,,,,0,,,80,2,180,2,24.691359,,2,,,,,0,,0,,,
200635497,,Sweden,,,,1,1,33,,,,0,,,98,2,190,2,27.146814,,3,,,,,0,,0,,,
200635498,,Sweden,,,,1,2,37,,,,0,,,52,2,158,2,20.829996,,2,,,,,0,,0,,,
200635499,,Sweden,,,,1,1,31,,,,0,,,70,2,177,2,22.343515,,2,,,,,0,,0,,,
200635500,,Sweden,,,,1,1,31,,,,0,,,75,2,185,2,21.913805,,2,,,,,0,,0,,,
200635501,,Sweden,,,,1,2,30,,,,0,,,60,2,168,2,21.258503,,2,,,,,0,,0,,,
200635502,,Sweden,,,,1,2,30,,,,0,,,74,2,173,2,24.725183,,2,,,,,0,,0,,,
200635503,,Sweden,,,,1,2,22,,,,0,,,53.5,2,163,2,20.13625,,2,,,,,0,,0,,,
200635504,,Sweden,,,,1,1,29,,,,0,,,72,2,173,2,24.056934,,2,,,,,0,,0,,,
200635505,,Sweden,,,,1,2,27,,,,0,,,67,2,169,2,23.458563,,2,,,,,0,,0,,,
200635506,,Sweden,,,,1,1,35,,,,0,,,69,2,179,2,21.534908,,2,,,,,0,,0,,,
200635507,,Sweden,,,,1,2,22,,,,,,,62,2,172,2,20.957273,,2,,,,,0,,0,,,
200635508,,Sweden,,,,1,1,72,,,,0,,,75,2,176,2,24.212294,,2,,,,,0,,0,,,
200635509,,Sweden,,,,1,2,64,,,,0,,,84,2,164,2,31.231409,,4,,,,,0,,0,,,
200635510,,Sweden,,,,1,2,63,,,,0,,,75,2,165,2,27.54821,,3,,,,,0,,0,,,
200635511,,Sweden,,,,1,2,63,,,,0,,,66,2,166,2,23.951227,,2,,,,,0,,0,,,
200635512,,Sweden,,,,1,1,64,,,,0,,,84,2,181,2,25.640244,,3,,,,,0,,0,,,
200635513,,Sweden,,,,1,2,64,,,,0,,,72,2,163,2,27.099251,,3,,,,,0,,0,,,
200635514,,Sweden,,,,1,2,59,,,,0,,,72,2,173,2,24.056934,,2,,,,,0,,0,,,
200635515,,Sweden,,,,1,1,45,,,,0,,,66,2,167,2,23.665245,,2,,,,,0,,0,,,
200635516,,Sweden,,,,1,2,54,,,,0,,,67,2,168,2,23.738663,,2,,,,,0,,0,,,
200635517,,Sweden,,,,1,1,55,,,,0,,,80.861092,3,179.49901,3,25.096636,,3,,,,,0,,0,,,
200635518,,Sweden,,,,1,1,55,,,,0,,,73,2,176,2,23.566631,,2,,,,,0,,0,,,
200635519,,Sweden,,,,1,1,53,,,,0,,,74,2,176,2,23.889463,,2,,,,,0,,0,,,
200635520,,Sweden,,,,1,2,51,,,,0,,,54,2,163,2,20.324438,,2,,,,,0,,0,,,
200635521,,Sweden,,,,1,2,44,,,,0,,,87,2,163,2,32.744926,,4,,,,,0,,0,,,
200635522,,Sweden,,,,1,2,48,,,,0,,,58,2,162,2,22.10029,,2,,,,,0,,0,,,
200635523,,Sweden,,,,1,1,49,,,,0,,,83,2,191,2,22.75157,,2,,,,,0,,0,,,
200635524,,Sweden,,,,1,1,48,,,,0,,,91,2,184,2,26.878544,,3,,,,,0,,0,,,
200635525,,Sweden,,,,1,1,48,,,,0,,,86,2,172,2,29.069767,,3,,,,,0,,0,,,
200635526,,Sweden,,,,1,1,47,,,,0,,,70,2,167,2,25.099501,,3,,,,,0,,0,,,
200635527,,Sweden,,,,1,2,46,,,,0,,,63,2,160,2,24.609375,,2,,,,,0,,0,,,
200635528,,Sweden,,,,1,1,46,,,,0,,,58,2,174,2,19.157087,,2,,,,,0,,0,,,
200635529,,Sweden,,,,1,2,45,,,,0,,,52,2,168,2,18.424036,,1,,,,,0,,0,,,
200635530,,Sweden,,,,1,1,45,,,,0,,,90,2,170,2,31.141869,,4,,,,,0,,0,,,
200635531,,Sweden,,,,1,2,44,,,,0,,,80,2,170,2,27.681662,,3,,,,,0,,0,,,
200635532,,Sweden,,,,1,1,42,,,,0,,,75,2,182,2,22.642193,,2,,,,,0,,0,,,
200635533,,Sweden,,,,1,1,42,,,,0,,,92,2,183,2,27.471706,,3,,,,,0,,0,,,
200635534,,Sweden,,,,1,2,42,,,,0,,,54,2,165,2,19.834711,,2,,,,,0,,0,,,
200635535,,Sweden,,,,1,1,38,,,,0,,,100,2,197,2,25.76722,,3,,,,,0,,0,,,
200635536,,Sweden,,,,1,2,38,,,,0,,,57,2,164,2,21.192743,,2,,,,,0,,0,,,
200635537,,Sweden,,,,1,1,37,,,,0,,,71,2,170,2,24.567474,,2,,,,,0,,0,,,
200635538,,Sweden,,,,1,1,38,,,,0,,,75,2,174,2,24.772097,,2,,,,,0,,0,,,
200635539,,Sweden,,,,1,2,32,,,,0,,,58,2,165,2,21.303949,,2,,,,,0,,0,,,
200635540,,Sweden,,,,1,2,37,,,,0,,,60,2,162,2,22.862368,,2,,,,,0,,0,,,
200635541,,Sweden,,,,1,2,34,,,,0,,,56,2,160,2,21.875,,2,,,,,0,,0,,,
200635542,,Sweden,,,,1,2,26,,,,0,,,72,2,177,2,22.981901,,2,,,,,0,,0,,,
200635543,,Sweden,,,,1,2,35,,,,2,,,98,2,167,2,35.139301,,4,,,,,0,,0,,,
200635544,,Sweden,,,,1,2,34,,,,2,,,66,2,166,2,23.951227,,2,,,,,0,,0,,,
200635545,,Sweden,,,,1,2,35,,,,0,,,82,2,180,2,25.308641,,3,,,,,0,,0,,,
200635546,,Sweden,,,,1,2,30,,,,1,,,60,2,163,2,22.582708,,2,,,,,0,,0,,,
200635547,,Sweden,,,,1,1,30,,,,0,,,81,2,186,2,23.413111,,2,,,,,0,,0,,,
200635548,,Sweden,,,,1,2,20,,,,0,,,62,2,170,2,21.453287,,2,,,,,0,,0,,,
200635549,,Sweden,,,,1,1,27,,,,0,,,75,2,178,2,23.671253,,2,,,,,0,,0,,,
200635550,,Sweden,,,,1,2,26,,,,0,,,54,2,162,2,20.576132,,2,,,,,1,,0,,,
200635551,,Sweden,,,,1,1,26,,,,2,,,70,2,164,2,26.026175,,3,,,,,0,,0,,,