id,hh_id,country,sec_area,tert_area,round,smpl_weight,sex,age,edc_level,edc,residence,preg_lact,breastfeeding,hh_head,wgt,wgt_method,hgt,hgt_method,bmi_adults,bmi_children,bmi_cat,misrep,pa,pa_cat,smok,special_diet,special_diet_other,clin_diet,clin_diet_other,note,bmi_chld
1,,Pakistan,Sindh,Thatta District,1,,2,25,1,no formal schooling,1,1,,,41,1,157.7,1,16.486197,,1,,,,,0,,0,,,
2,,Pakistan,Sindh,Thatta District,1,,2,30,1,no formal schooling,1,1,,,45,1,152.5,1,19.349638,,2,,,,,0,,0,,,
3,,Pakistan,Sindh,Thatta District,1,,2,19,1,no formal schooling,1,1,,,47.5,1,154,1,,,,,,,,0,,0,,,20.028673
4,,Pakistan,Sindh,Thatta District,1,,2,27,1,no formal schooling,1,1,,,45.5,1,156.3,1,18.624878,,2,,,,,0,,0,,,
5,,Pakistan,Sindh,Thatta District,1,,2,26,1,primary,1,1,,,53,1,160.5,1,20.574335,,2,,,,,0,,0,,,
6,,Pakistan,Sindh,Thatta District,1,,2,18,1,no formal schooling,1,1,,,46.5,1,146.7,1,,,,,,,,0,,0,,,21.606915
7,,Pakistan,Sindh,Thatta District,1,,2,18,1,no formal schooling,1,1,,,40.5,1,176,1,,,,,,,,0,,0,,,13.074638
8,,Pakistan,Sindh,Thatta District,1,,2,23,1,no formal schooling,1,1,,,40.5,1,140.5,1,20.516457,,2,,,,,0,,0,,,
9,,Pakistan,Sindh,Thatta District,1,,2,22,1,no formal schooling,1,1,,,42,1,154.3,1,17.640766,,1,,,,,0,,0,,,
10,,Pakistan,Sindh,Thatta District,1,,2,29,1,no formal schooling,1,1,,,46.5,1,154,1,19.607016,,2,,,,,0,,0,,,
11,,Pakistan,Sindh,Thatta District,1,,2,33,1,no formal schooling,1,1,,,53.5,1,149.8,1,23.841311,,2,,,,,0,,0,,,
12,,Pakistan,Sindh,Thatta District,1,,2,17,1,no formal schooling,1,1,,,31.5,1,151.39999,1,,,,,,,,0,,0,,,13.742281
13,,Pakistan,Sindh,Thatta District,1,,2,20,1,no formal schooling,1,1,,,,,157.39999,1,,,,,,,,0,,0,,Missing value for weight,
14,,Pakistan,Sindh,Thatta District,1,,2,21,1,no formal schooling,1,1,,,43.5,1,149,1,19.593712,,2,,,,,0,,0,,,
15,,Pakistan,Sindh,Thatta District,1,,2,20,1,no formal schooling,1,1,,,46,1,148,1,21.000731,,2,,,,,0,,0,,,
16,,Pakistan,Sindh,Thatta District,1,,2,21,1,primary,1,1,,,50,1,153,1,21.359306,,2,,,,,0,,0,,,
17,,Pakistan,Sindh,Thatta District,1,,2,21,1,no formal schooling,1,1,,,41.5,1,150,1,18.444445,,1,,,,,0,,0,,,
18,,Pakistan,Sindh,Thatta District,1,,2,25,1,primary,1,1,,,49,1,148,1,22.370344,,2,,,,,0,,0,,,
19,,Pakistan,Sindh,Thatta District,1,,2,32,1,no formal schooling,1,1,,,45,1,146,1,21.110903,,2,,,,,0,,0,,,
20,,Pakistan,Sindh,Thatta District,1,,2,26,2,secondary,1,1,,,46.5,1,148,1,21.229,,2,,,,,0,,0,,,
21,,Pakistan,Sindh,Thatta District,1,,2,21,1,no formal schooling,1,1,,,,,147,1,,,,,,,,0,,0,,Missing value for weight,
22,,Pakistan,Sindh,Thatta District,1,,2,26,1,no formal schooling,1,1,,,43.5,1,144,1,20.97801,,2,,,,,0,,0,,,
23,,Pakistan,Sindh,Thatta District,1,,2,19,1,no formal schooling,1,1,,,48,1,160.39999,1,,,,,,,,0,,0,,,18.656601
24,,Pakistan,Sindh,Thatta District,1,,2,20,2,secondary,1,1,,,45,1,156.10001,1,18.46744,,1,,,,,0,,0,,,
25,,Pakistan,Sindh,Thatta District,1,,2,24,1,no formal schooling,1,1,,,44.5,1,157,1,18.053471,,1,,,,,0,,0,,,
26,,Pakistan,Sindh,Thatta District,1,,2,25,2,secondary,1,1,,,49,1,156.2,1,20.083252,,2,,,,,0,,0,,,
27,,Pakistan,Sindh,Thatta District,1,,2,22,2,secondary,1,1,,,35.5,1,153,1,15.165108,,1,,,,,0,,0,,,
28,,Pakistan,Sindh,Thatta District,1,,2,23,1,no formal schooling,1,1,,,44.5,1,165.2,1,16.305719,,1,,,,,0,,0,,,
29,,Pakistan,Sindh,Thatta District,1,,2,27,1,no formal schooling,1,1,,,42,1,152.2,1,18.130926,,1,,,,,0,,0,,,
30,,Pakistan,Sindh,Thatta District,1,,2,21,1,no formal schooling,1,1,,,51.5,1,138.2,1,26.964424,,3,,,,,0,,0,,,
31,,Pakistan,Sindh,Thatta District,1,,2,25,1,no formal schooling,1,1,,,47,1,157,1,19.067711,,2,,,,,0,,0,,,
32,,Pakistan,Sindh,Thatta District,1,,2,19,1,no formal schooling,1,1,,,45.5,1,163,1,,,,,,,,0,,0,,,17.125221
33,,Pakistan,Sindh,Thatta District,1,,2,31,1,no formal schooling,1,1,,,46,1,140.5,1,23.302643,,2,,,,,0,,0,,,
34,,Pakistan,Sindh,Thatta District,1,,2,21,1,no formal schooling,1,1,,,56.5,1,160,1,22.070313,,2,,,,,0,,0,,,
35,,Pakistan,Sindh,Thatta District,1,,2,31,1,no formal schooling,1,1,,,66,1,150.8,1,29.022928,,3,,,,,0,,0,,,
36,,Pakistan,Sindh,Thatta District,1,,2,19,1,no formal schooling,1,1,,,39.5,1,159.5,1,,,,,,,,0,,0,,,15.526577
37,,Pakistan,Sindh,Thatta District,1,,2,25,1,no formal schooling,1,1,,,33,1,157,1,13.387967,,1,,,,,0,,0,,,
38,,Pakistan,Sindh,Thatta District,1,,2,21,2,secondary,1,1,,,50,1,156.5,1,20.414621,,2,,,,,0,,0,,,
39,,Pakistan,Sindh,Thatta District,1,,2,18,1,no formal schooling,1,1,,,42.5,1,152.5,1,,,,,,,,0,,0,,,18.274658
40,,Pakistan,Sindh,Thatta District,1,,2,25,1,no formal schooling,1,1,,,37,1,153.5,1,15.703084,,1,,,,,0,,0,,,
41,,Pakistan,Sindh,Thatta District,1,,2,18,2,secondary,1,1,,,34,1,147.5,1,,,,,,,,0,,0,,,15.627693
42,,Pakistan,Sindh,Thatta District,1,,2,30,1,no formal schooling,1,1,,,44.5,1,153.5,1,18.886143,,2,,,,,0,,0,,,
43,,Pakistan,Sindh,Thatta District,1,,2,20,1,no formal schooling,1,1,,,41.5,1,150,1,18.444445,,1,,,,,0,,0,,,
44,,Pakistan,Sindh,Thatta District,1,,2,28,1,no formal schooling,1,1,,,44.5,1,158,1,17.825668,,1,,,,,0,,0,,,
45,,Pakistan,Sindh,Thatta District,1,,2,29,1,no formal schooling,1,1,,,46,1,150,1,20.444445,,2,,,,,0,,0,,,
46,,Pakistan,Sindh,Thatta District,1,,2,20,2,secondary,1,1,,,45,1,153,1,19.223375,,2,,,,,0,,0,,,
47,,Pakistan,Sindh,Thatta District,1,,2,26,1,no formal schooling,1,1,,,39,1,140.39999,1,19.784744,,2,,,,,0,,0,,,
48,,Pakistan,Sindh,Thatta District,1,,2,20,1,no formal schooling,1,1,,,55.5,1,155.60001,1,22.923122,,2,,,,,0,,0,,,
49,,Pakistan,Sindh,Thatta District,1,,2,28,1,no formal schooling,1,1,,,,,152,1,,,,,,,,0,,0,,Missing value for weight,
50,,Pakistan,Sindh,Thatta District,1,,2,26,1,no formal schooling,1,1,,,49.5,1,160,1,19.335938,,2,,,,,0,,0,,,
51,,Pakistan,Sindh,Thatta District,1,,2,25,1,no formal schooling,1,1,,,52,1,158.5,1,20.698784,,2,,,,,0,,0,,,
52,,Pakistan,Sindh,Thatta District,1,,2,22,1,no formal schooling,1,1,,,38.5,1,150.2,1,17.065573,,1,,,,,0,,0,,,
53,,Pakistan,Sindh,Thatta District,1,,2,26,1,no formal schooling,1,1,,,47,1,160.10001,1,18.336447,,1,,,,,0,,0,,,
54,,Pakistan,Sindh,Thatta District,1,,2,22,1,no formal schooling,1,1,,,43.5,1,150.8,1,19.128748,,2,,,,,0,,0,,,
55,,Pakistan,Sindh,Thatta District,1,,2,26,1,no formal schooling,1,1,,,65.5,1,150.5,1,28.918003,,3,,,,,0,,0,,,
56,,Pakistan,Sindh,Thatta District,1,,2,25,2,secondary,1,1,,,52.5,1,150,1,23.333334,,2,,,,,0,,0,,,
57,,Pakistan,Sindh,Thatta District,1,,2,26,1,primary,1,1,,,41,1,150.5,1,18.101345,,1,,,,,0,,0,,,
58,,Pakistan,Sindh,Thatta District,1,,2,22,1,no formal schooling,1,1,,,45,1,145.2,1,21.344172,,2,,,,,0,,0,,,
59,,Pakistan,Sindh,Thatta District,1,,2,24,1,no formal schooling,1,1,,,40,1,150,1,17.777779,,1,,,,,0,,0,,,
60,,Pakistan,Sindh,Thatta District,1,,2,29,1,no formal schooling,1,1,,,64,1,159.5,1,25.156986,,3,,,,,0,,0,,,
61,,Pakistan,Sindh,Thatta District,1,,2,26,1,no formal schooling,1,1,,,32.5,1,140,1,16.581633,,1,,,,,0,,0,,,
62,,Pakistan,Sindh,Thatta District,1,,2,18,1,no formal schooling,1,1,,,,,160.39999,1,,,,,,,,0,,0,,Missing value for weight,
63,,Pakistan,Sindh,Thatta District,1,,2,19,1,no formal schooling,1,1,,,,,150.5,1,,,,,,,,0,,0,,Missing value for weight,
64,,Pakistan,Sindh,Thatta District,1,,2,24,1,no formal schooling,1,1,,,41,1,145,1,19.500595,,2,,,,,0,,0,,,
65,,Pakistan,Sindh,Thatta District,1,,2,33,1,no formal schooling,1,1,,,45,1,150.5,1,19.867331,,2,,,,,0,,0,,,
66,,Pakistan,Sindh,Thatta District,1,,2,33,1,no formal schooling,1,1,,,49,1,150,1,21.777779,,2,,,,,0,,0,,,
67,,Pakistan,Sindh,Thatta District,1,,2,19,1,no formal schooling,1,1,,,37,1,142,1,,,,,,,,0,,0,,,18.349533
68,,Pakistan,Sindh,Thatta District,1,,2,18,1,no formal schooling,1,1,,,34.5,1,143.10001,1,,,,,,,,0,,0,,,16.847668
69,,Pakistan,Sindh,Thatta District,1,,2,21,1,no formal schooling,1,1,,,47,1,153.10001,1,20.051527,,2,,,,,0,,0,,,
70,,Pakistan,Sindh,Thatta District,1,,2,25,1,no formal schooling,1,1,,,50,1,140.7,1,25.257004,,3,,,,,0,,0,,,
71,,Pakistan,Sindh,Thatta District,1,,2,30,1,primary,1,1,,,44.5,1,150.8,1,19.568489,,2,,,,,0,,0,,,
72,,Pakistan,Sindh,Thatta District,1,,2,17,1,no formal schooling,1,1,,,50.5,1,140.8,1,,,,,,,,0,,0,,,25.473349
73,,Pakistan,Sindh,Thatta District,1,,2,28,1,no formal schooling,1,1,,,41.5,1,155,1,17.273674,,1,,,,,0,,0,,,
74,,Pakistan,Sindh,Thatta District,1,,2,24,1,no formal schooling,1,1,,,45,1,156,1,18.491125,,1,,,,,0,,0,,,
75,,Pakistan,Sindh,Thatta District,1,,2,25,1,primary,1,1,,,48,1,160,1,18.75,,2,,,,,0,,0,,,
76,,Pakistan,Sindh,Thatta District,1,,2,22,1,no formal schooling,1,1,,,43.5,1,150,1,19.333334,,2,,,,,0,,0,,,
77,,Pakistan,Sindh,Thatta District,1,,2,25,1,no formal schooling,1,1,,,34.5,1,140,1,17.602041,,1,,,,,0,,0,,,
78,,Pakistan,Sindh,Thatta District,1,,2,26,1,no formal schooling,1,1,,,44.5,1,149,1,20.044142,,2,,,,,0,,0,,,
79,,Pakistan,Sindh,Thatta District,1,,2,27,1,no formal schooling,1,1,,,43.5,1,152,1,18.827909,,2,,,,,0,,0,,,
80,,Pakistan,Sindh,Thatta District,1,,2,26,1,no formal schooling,1,1,,,38.5,1,140,1,19.642857,,2,,,,,0,,0,,,
81,,Pakistan,Sindh,Thatta District,1,,2,27,1,no formal schooling,1,1,,,45,1,150,1,20,,2,,,,,0,,0,,,
82,,Pakistan,Sindh,Thatta District,1,,2,27,1,no formal schooling,1,1,,,65,1,152.5,1,27.949476,,3,,,,,0,,0,,,
83,,Pakistan,Sindh,Thatta District,1,,2,28,1,no formal schooling,1,1,,,45,1,155,1,18.73049,,2,,,,,0,,0,,,
84,,Pakistan,Sindh,Thatta District,1,,2,25,1,primary,1,1,,,51.5,1,150,1,22.888889,,2,,,,,0,,0,,,
85,,Pakistan,Sindh,Thatta District,1,,2,27,1,primary,1,1,,,62.5,1,150,1,27.777779,,3,,,,,0,,0,,,
86,,Pakistan,Sindh,Thatta District,1,,2,30,1,no formal schooling,1,1,,,59.5,1,150,1,26.444445,,3,,,,,0,,0,,,
87,,Pakistan,Sindh,Thatta District,1,,2,27,1,no formal schooling,1,1,,,47,1,145,1,22.35434,,2,,,,,0,,0,,,
88,,Pakistan,Sindh,Thatta District,1,,2,29,1,no formal schooling,1,1,,,51,1,150,1,22.666666,,2,,,,,0,,0,,,
89,,Pakistan,Sindh,Thatta District,1,,2,29,1,no formal schooling,1,1,,,40,1,140,1,20.408163,,2,,,,,0,,0,,,
90,,Pakistan,Sindh,Thatta District,1,,2,19,1,primary,1,1,,,34.5,1,151.60001,1,,,,,,,,0,,0,,,15.011381
91,,Pakistan,Sindh,Thatta District,1,,2,18,1,no formal schooling,1,1,,,46,1,152.8,1,,,,,,,,0,,0,,,19.702036
92,,Pakistan,Sindh,Thatta District,1,,2,17,1,no formal schooling,1,1,,,51.5,1,155.8,1,,,,,,,,0,,0,,,21.216431
93,,Pakistan,Sindh,Thatta District,1,,2,16,1,no formal schooling,1,1,,,45,1,159,1,,,,,,,,0,,0,,,17.799929
94,,Pakistan,Sindh,Thatta District,1,,2,22,2,secondary,1,1,,,36,1,151.39999,1,15.705464,,1,,,,,0,,0,,,
95,,Pakistan,Sindh,Thatta District,1,,2,29,2,secondary,1,1,,,51.5,1,145.5,1,24.32659,,2,,,,,0,,0,,,
96,,Pakistan,Sindh,Thatta District,1,,2,29,1,no formal schooling,1,1,,,43,1,155.39999,1,17.806004,,1,,,,,0,,0,,,
97,,Pakistan,Sindh,Thatta District,1,,2,16,1,no formal schooling,1,1,,,53,1,151,1,,,,,,,,0,,0,,,23.244595
98,,Pakistan,Sindh,Thatta District,1,,2,20,1,no formal schooling,1,1,,,56,1,156,1,23.011177,,2,,,,,0,,0,,,
99,,Pakistan,Sindh,Thatta District,1,,2,33,1,no formal schooling,1,1,,,42.5,1,143,1,20.783413,,2,,,,,0,,0,,,
100,,Pakistan,Sindh,Thatta District,1,,2,22,2,secondary,1,1,,,41,1,154,1,17.287907,,1,,,,,0,,0,,,
101,,Pakistan,Sindh,Thatta District,1,,2,22,1,no formal schooling,1,1,,,52.5,1,161,1,20.253849,,2,,,,,0,,0,,,
102,,Pakistan,Sindh,Thatta District,1,,2,20,2,secondary,1,1,,,34.5,1,150,1,15.333333,,1,,,,,0,,0,,,
103,,Pakistan,Sindh,Thatta District,1,,2,22,1,no formal schooling,1,1,,,45.5,1,153,1,19.436968,,2,,,,,0,,0,,,
104,,Pakistan,Sindh,Thatta District,1,,2,22,1,no formal schooling,1,1,,,40.5,1,149.2,1,18.193548,,1,,,,,0,,0,,,
105,,Pakistan,Sindh,Thatta District,1,,2,19,1,no formal schooling,1,1,,,44.5,1,160,1,,,,,,,,0,,0,,,17.382813
106,,Pakistan,Sindh,Thatta District,1,,2,23,1,no formal schooling,1,1,,,50,1,157.60001,1,20.130638,,2,,,,,0,,0,,,
107,,Pakistan,Sindh,Thatta District,1,,2,17,1,primary,1,1,,,55.5,1,153.10001,1,,,,,,,,0,,0,,,23.677866
108,,Pakistan,Sindh,Thatta District,1,,2,27,2,secondary,1,1,,,66,1,156.5,1,26.9473,,3,,,,,0,,0,,,
109,,Pakistan,Sindh,Thatta District,1,,2,25,1,no formal schooling,1,1,,,44.5,1,150.2,1,19.725143,,2,,,,,0,,0,,,
110,,Pakistan,Sindh,Thatta District,1,,2,28,1,primary,1,1,,,41.5,1,159.5,1,16.312733,,1,,,,,0,,0,,,
111,,Pakistan,Sindh,Thatta District,1,,2,22,1,no formal schooling,1,1,,,53.5,1,169,1,18.731836,,2,,,,,0,,0,,,
112,,Pakistan,Sindh,Thatta District,1,,2,21,1,no formal schooling,1,1,,,36.5,1,154.2,1,15.350556,,1,,,,,0,,0,,,
113,,Pakistan,Sindh,Thatta District,1,,2,27,1,primary,1,1,,,47,1,152,1,20.342798,,2,,,,,0,,0,,,
114,,Pakistan,Sindh,Thatta District,1,,2,17,1,no formal schooling,1,1,,,,,158,1,,,,,,,,0,,0,,Missing value for weight,
115,,Pakistan,Sindh,Thatta District,1,,2,31,1,no formal schooling,1,1,,,53.5,1,151.5,1,23.309261,,2,,,,,0,,0,,,
116,,Pakistan,Sindh,Thatta District,1,,2,18,1,primary,1,1,,,46.5,1,145,1,,,,,,,,0,,0,,,22.116528
117,,Pakistan,Sindh,Thatta District,1,,2,19,1,no formal schooling,1,1,,,47,1,162,1,,,,,,,,0,,0,,,17.908855
118,,Pakistan,Sindh,Thatta District,1,,2,27,1,no formal schooling,1,1,,,48.5,1,152.8,1,20.772799,,2,,,,,0,,0,,,
119,,Pakistan,Sindh,Thatta District,1,,2,23,1,no formal schooling,1,1,,,47.5,1,134.3,1,26.335501,,3,,,,,0,,0,,,
120,,Pakistan,Sindh,Thatta District,1,,2,30,1,no formal schooling,1,1,,,40.5,1,145.5,1,19.130619,,2,,,,,0,,0,,,
121,,Pakistan,Sindh,Thatta District,1,,2,26,1,no formal schooling,1,1,,,55,1,146.5,1,25.62639,,3,,,,,0,,0,,,
122,,Pakistan,Sindh,Thatta District,1,,2,25,1,no formal schooling,1,1,,,46,1,163.3,1,17.249855,,1,,,,,0,,0,,,
123,,Pakistan,Sindh,Thatta District,1,,2,30,1,no formal schooling,1,1,,,48.5,1,144,1,23.389275,,2,,,,,0,,0,,,
124,,Pakistan,Sindh,Thatta District,1,,2,32,1,no formal schooling,1,1,,,42,1,140,1,21.428572,,2,,,,,0,,0,,,
125,,Pakistan,Sindh,Thatta District,1,,2,27,1,no formal schooling,1,1,,,45.5,1,143,1,22.250477,,2,,,,,0,,0,,,
126,,Pakistan,Sindh,Thatta District,1,,2,31,1,no formal schooling,1,1,,,46,1,154,1,19.396189,,2,,,,,0,,0,,,
127,,Pakistan,Sindh,Thatta District,1,,2,22,2,secondary,1,1,,,44,1,151.2,1,19.246382,,2,,,,,0,,0,,,
128,,Pakistan,Sindh,Thatta District,1,,2,32,1,no formal schooling,1,1,,,41,1,146.5,1,19.10331,,2,,,,,0,,0,,,
129,,Pakistan,Sindh,Thatta District,1,,2,25,1,no formal schooling,1,1,,,44.5,1,145.60001,1,20.991198,,2,,,,,0,,0,,,
130,,Pakistan,Sindh,Thatta District,1,,2,30,1,no formal schooling,1,1,,,42,1,150.60001,1,18.518223,,2,,,,,0,,0,,,
131,,Pakistan,Sindh,Thatta District,1,,2,29,1,no formal schooling,1,1,,,,,150.3,1,,,,,,,,0,,0,,Missing value for weight,
132,,Pakistan,Sindh,Thatta District,1,,2,17,1,no formal schooling,1,1,,,32,1,150.2,1,,,,,,,,0,,0,,,14.184373
133,,Pakistan,Sindh,Thatta District,1,,2,18,1,no formal schooling,1,1,,,50,1,145.39999,1,,,,,,,,0,,0,,,23.650549
134,,Pakistan,Sindh,Thatta District,1,,2,25,2,secondary,1,1,,,43,1,154.5,1,18.014055,,1,,,,,0,,0,,,
135,,Pakistan,Sindh,Thatta District,1,,2,18,1,primary,1,1,,,35.5,1,141,1,,,,,,,,0,,0,,,17.856245
136,,Pakistan,Sindh,Thatta District,1,,2,18,1,no formal schooling,1,1,,,44.5,1,155,1,,,,,,,,0,,0,,,18.522373
137,,Pakistan,Sindh,Thatta District,1,,2,20,2,secondary,1,1,,,45.5,1,150.2,1,20.168406,,2,,,,,0,,0,,,
138,,Pakistan,Sindh,Thatta District,1,,2,23,1,no formal schooling,1,1,,,39.5,1,147.39999,1,18.180347,,1,,,,,0,,0,,,
139,,Pakistan,Sindh,Thatta District,1,,2,27,1,no formal schooling,1,1,,,53.5,1,152.2,1,23.095346,,2,,,,,0,,0,,,
140,,Pakistan,Sindh,Thatta District,1,,2,20,1,no formal schooling,1,1,,,48,1,151,1,21.051708,,2,,,,,0,,0,,,
141,,Pakistan,Sindh,Thatta District,1,,2,24,1,no formal schooling,1,1,,,65,1,154,1,27.407658,,3,,,,,0,,0,,,
142,,Pakistan,Sindh,Thatta District,1,,2,19,1,no formal schooling,1,1,,,49.5,1,147.7,1,,,,,,,,0,,0,,,22.690508
143,,Pakistan,Sindh,Thatta District,1,,2,17,1,no formal schooling,1,1,,,42.5,1,153,1,,,,,,,,0,,0,,,18.155411
144,,Pakistan,Sindh,Thatta District,1,,2,18,1,no formal schooling,1,1,,,43.5,1,154.5,1,,,,,,,,0,,0,,,18.22352
145,,Pakistan,Sindh,Thatta District,1,,2,18,1,no formal schooling,1,1,,,49,1,150.8,1,,,,,,,,0,,0,,,21.547325
146,,Pakistan,Sindh,Thatta District,1,,2,20,1,no formal schooling,1,1,,,,,150.89999,1,,,,,,,,0,,0,,Missing value for weight,
147,,Pakistan,Sindh,Thatta District,1,,2,18,1,no formal schooling,1,1,,,49.5,1,163,1,,,,,,,,0,,0,,,18.630735
148,,Pakistan,Sindh,Thatta District,1,,2,19,1,no formal schooling,1,1,,,45.5,1,147,1,,,,,,,,0,,0,,,21.056042
149,,Pakistan,Sindh,Thatta District,1,,2,20,1,no formal schooling,1,1,,,,,151,1,,,,,,,,0,,0,,Missing value for weight,
150,,Pakistan,Sindh,Thatta District,1,,2,23,1,no formal schooling,1,1,,,41.5,1,160,1,16.210938,,1,,,,,0,,0,,,
151,,Pakistan,Sindh,Thatta District,1,,2,20,1,no formal schooling,1,1,,,47.5,1,153,1,20.291342,,2,,,,,0,,0,,,
152,,Pakistan,Sindh,Thatta District,1,,2,31,1,no formal schooling,1,1,,,59,1,165,1,21.671259,,2,,,,,0,,0,,,
153,,Pakistan,Sindh,Thatta District,1,,2,25,1,no formal schooling,1,1,,,45.5,1,155.8,1,18.744614,,2,,,,,0,,0,,,
154,,Pakistan,Sindh,Thatta District,1,,2,16,1,no formal schooling,1,1,,,44,1,148,1,,,,,,,,0,,0,,,20.087656
155,,Pakistan,Sindh,Thatta District,1,,2,28,1,no formal schooling,1,1,,,59.5,1,155,1,24.765869,,2,,,,,0,,0,,,
156,,Pakistan,Sindh,Thatta District,1,,2,17,1,no formal schooling,1,1,,,40.5,1,150,1,,,,,,,,0,,0,,,18
157,,Pakistan,Sindh,Thatta District,1,,2,23,1,no formal schooling,1,1,,,42,1,150.3,1,18.592222,,2,,,,,0,,0,,,
158,,Pakistan,Sindh,Thatta District,1,,2,29,1,no formal schooling,1,1,,,36.5,1,140.5,1,18.490141,,1,,,,,0,,0,,,
159,,Pakistan,Sindh,Thatta District,1,,2,22,1,no formal schooling,1,1,,,47,1,140.2,1,23.911226,,2,,,,,0,,0,,,
160,,Pakistan,Sindh,Thatta District,1,,2,21,1,no formal schooling,1,1,,,,,150.3,1,,,,,,,,0,,0,,Missing value for weight,
161,,Pakistan,Sindh,Thatta District,1,,2,22,1,no formal schooling,1,1,,,42.5,1,140.8,1,21.437967,,2,,,,,0,,0,,,
162,,Pakistan,Sindh,Thatta District,1,,2,23,1,no formal schooling,1,1,,,51,1,150.3,1,22.576271,,2,,,,,0,,0,,,
163,,Pakistan,Sindh,Thatta District,1,,2,23,1,no formal schooling,1,1,,,50,1,160.10001,1,19.506857,,2,,,,,0,,0,,,
164,,Pakistan,Sindh,Thatta District,1,,2,22,1,no formal schooling,1,1,,,48.5,1,150.5,1,21.412567,,2,,,,,0,,0,,,
165,,Pakistan,Sindh,Thatta District,1,,2,24,1,no formal schooling,1,1,,,42,1,156,1,17.258383,,1,,,,,0,,0,,,
166,,Pakistan,Sindh,Thatta District,1,,2,23,1,no formal schooling,1,1,,,38,1,145,1,18.073721,,1,,,,,0,,0,,,
167,,Pakistan,Sindh,Thatta District,1,,2,24,1,no formal schooling,1,1,,,50,1,156,1,20.545694,,2,,,,,0,,0,,,
168,,Pakistan,Sindh,Thatta District,1,,2,28,1,no formal schooling,1,1,,,73,1,159,1,28.875441,,3,,,,,0,,0,,,
169,,Pakistan,Sindh,Thatta District,1,,2,18,1,no formal schooling,1,1,,,49,1,154,1,,,,,,,,0,,0,,,20.661158
170,,Pakistan,Sindh,Thatta District,1,,2,24,1,no formal schooling,1,1,,,46,1,154,1,19.396189,,2,,,,,0,,0,,,
171,,Pakistan,Sindh,Thatta District,1,,2,26,1,no formal schooling,1,1,,,46,1,150,1,20.444445,,2,,,,,0,,0,,,
172,,Pakistan,Sindh,Thatta District,1,,2,28,1,no formal schooling,1,1,,,41,1,148,1,18.718042,,2,,,,,0,,0,,,
173,,Pakistan,Sindh,Thatta District,1,,2,27,1,no formal schooling,1,1,,,39,1,144,1,18.807871,,2,,,,,0,,0,,,
174,,Pakistan,Sindh,Thatta District,1,,2,27,1,no formal schooling,1,1,,,51,1,161,1,19.675167,,2,,,,,0,,0,,,
175,,Pakistan,Sindh,Thatta District,1,,2,23,1,no formal schooling,1,1,,,48.5,1,165,1,17.814508,,1,,,,,0,,0,,,
176,,Pakistan,Sindh,Thatta District,1,,2,27,1,no formal schooling,1,1,,,44.5,1,167,1,15.956112,,1,,,,,0,,0,,,
177,,Pakistan,Sindh,Thatta District,1,,2,22,1,no formal schooling,1,1,,,44,1,154,1,18.552876,,2,,,,,0,,0,,,
178,,Pakistan,Sindh,Thatta District,1,,2,23,1,no formal schooling,1,1,,,50.5,1,156,1,20.75115,,2,,,,,0,,0,,,
179,,Pakistan,Sindh,Thatta District,1,,2,26,1,no formal schooling,1,1,,,44.5,1,151,1,19.516687,,2,,,,,0,,0,,,
181,,Pakistan,Sindh,Thatta District,1,,2,26,1,no formal schooling,1,1,,,,,150,1,,,,,,,,0,,0,,Missing value for weight,
182,,Pakistan,Sindh,Thatta District,1,,2,20,1,no formal schooling,1,1,,,37.5,1,155,1,15.608741,,1,,,,,0,,0,,,
183,,Pakistan,Sindh,Thatta District,1,,2,30,1,no formal schooling,1,1,,,46.5,1,150,1,20.666666,,2,,,,,0,,0,,,
184,,Pakistan,Sindh,Thatta District,1,,2,26,1,no formal schooling,1,1,,,51.5,1,150,1,22.888889,,2,,,,,0,,0,,,
185,,Pakistan,Sindh,Thatta District,1,,2,24,1,no formal schooling,1,1,,,46,1,160,1,17.96875,,1,,,,,0,,0,,,
186,,Pakistan,Sindh,Thatta District,1,,2,29,1,no formal schooling,1,1,,,57,1,150.39999,1,25.198763,,3,,,,,0,,0,,,
187,,Pakistan,Sindh,Thatta District,1,,2,27,1,no formal schooling,1,1,,,58,1,150.10001,1,25.743439,,3,,,,,0,,0,,,
188,,Pakistan,Sindh,Thatta District,1,,2,20,1,no formal schooling,1,1,,,37,1,150.2,1,16.400681,,1,,,,,0,,0,,,
189,,Pakistan,Sindh,Thatta District,1,,2,23,1,primary,1,1,,,43.5,1,151,1,19.07811,,2,,,,,0,,0,,,
190,,Pakistan,Sindh,Thatta District,1,,2,27,1,no formal schooling,1,1,,,45,1,153.7,1,19.048676,,2,,,,,0,,0,,,
191,,Pakistan,Sindh,Thatta District,1,,2,18,1,no formal schooling,1,1,,,45,1,163.3,1,,,,,,,,0,,0,,,16.874859
193,,Pakistan,Sindh,Thatta District,1,,2,28,1,no formal schooling,1,1,,,36.5,1,144.5,1,17.480633,,1,,,,,0,,0,,,
194,,Pakistan,Sindh,Thatta District,1,,2,26,1,no formal schooling,1,1,,,47,1,141,1,23.640661,,2,,,,,0,,0,,,
195,,Pakistan,Sindh,Thatta District,1,,2,27,1,no formal schooling,1,1,,,37,1,148,1,16.891891,,1,,,,,0,,0,,,
196,,Pakistan,Sindh,Thatta District,1,,2,18,1,no formal schooling,1,1,,,43,1,144,1,,,,,,,,0,,0,,,20.736883
197,,Pakistan,Sindh,Thatta District,1,,2,35,1,no formal schooling,1,1,,,65,1,153,1,27.767097,,3,,,,,0,,0,,,
198,,Pakistan,Sindh,Thatta District,1,,2,18,1,no formal schooling,1,1,,,51,1,160,1,,,,,,,,0,,0,,,19.921875
200,,Pakistan,Sindh,Thatta District,1,,2,28,1,no formal schooling,1,1,,,36.5,1,144.5,1,17.480633,,1,,,,,0,,0,,,
201,,Pakistan,Sindh,Thatta District,1,,2,20,1,primary,1,1,,,48.5,1,159.5,1,19.064278,,2,,,,,0,,0,,,
202,,Pakistan,Sindh,Thatta District,1,,2,25,1,no formal schooling,1,1,,,43.5,1,150,1,19.333334,,2,,,,,0,,0,,,
203,,Pakistan,Sindh,Thatta District,1,,2,20,1,no formal schooling,1,1,,,44,1,154.8,1,18.36161,,1,,,,,0,,0,,,
204,,Pakistan,Sindh,Thatta District,1,,2,23,1,no formal schooling,1,1,,,40,1,147.5,1,18.385521,,1,,,,,0,,0,,,
205,,Pakistan,Sindh,Thatta District,1,,2,17,1,no formal schooling,1,1,,,48.5,1,158,1,,,,,,,,0,,0,,,19.427977
206,,Pakistan,Sindh,Thatta District,1,,2,20,1,no formal schooling,1,1,,,42.5,1,150,1,18.888889,,2,,,,,0,,0,,,
207,,Pakistan,Sindh,Thatta District,1,,2,24,1,no formal schooling,1,1,,,52.5,1,158,1,21.030283,,2,,,,,0,,0,,,
208,,Pakistan,Sindh,Thatta District,1,,2,27,1,primary,1,1,,,,,166.39999,1,,,,,,,,0,,0,,Missing value for weight,
209,,Pakistan,Sindh,Thatta District,1,,2,20,1,no formal schooling,1,1,,,46.5,1,157,1,18.864862,,2,,,,,0,,0,,,
210,,Pakistan,Sindh,Thatta District,1,,2,18,1,no formal schooling,1,1,,,,,144,1,,,,,,,,0,,0,,Missing value for weight,
211,,Pakistan,Sindh,Thatta District,1,,2,29,1,no formal schooling,1,1,,,,,152,1,,,,,,,,0,,0,,Missing value for weight,
212,,Pakistan,Sindh,Thatta District,1,,2,25,1,primary,1,1,,,56,1,154,1,23.612751,,2,,,,,0,,0,,,
213,,Pakistan,Sindh,Thatta District,1,,2,28,1,no formal schooling,1,1,,,47.5,1,155,1,19.771072,,2,,,,,0,,0,,,
214,,Pakistan,Sindh,Thatta District,1,,2,18,1,no formal schooling,1,1,,,46,1,162,1,,,,,,,,0,,0,,,17.527817
215,,Pakistan,Sindh,Thatta District,1,,2,24,2,secondary,1,1,,,55.5,1,162,1,21.147692,,2,,,,,0,,0,,,
216,,Pakistan,Sindh,Thatta District,1,,2,24,1,no formal schooling,1,1,,,39,1,144,1,18.807871,,2,,,,,0,,0,,,
217,,Pakistan,Sindh,Thatta District,1,,2,29,1,no formal schooling,1,1,,,58,1,161,1,22.375679,,2,,,,,0,,0,,,
218,,Pakistan,Sindh,Thatta District,1,,2,28,1,no formal schooling,1,1,,,64.5,1,149,1,29.052746,,3,,,,,0,,0,,,
219,,Pakistan,Sindh,Thatta District,1,,2,17,1,no formal schooling,1,1,,,47,1,163,1,,,,,,,,0,,0,,,17.689789