id,hh_id,country,sec_area,tert_area,round,smpl_weight,sex,age,edc_level,edc,residence,preg_lact,breastfeeding,hh_head,wgt,wgt_method,hgt,hgt_method,bmi_adults,bmi_children,bmi_cat,misrep,pa,pa_cat,smok,special_diet,special_diet_other,clin_diet,clin_diet_other,note,bmi_chld,muac,wfh
KE001,,Kenya,,,1,.93268883228302,2,32,,,1,0,,,79.3,1,161.1999969482422,1,30.51709,,4,,,,,,,,,,,,
KE002,,Kenya,,,1,1.44145727157593,2,22,,,1,2,,,73.09999999999999,1,168.5,1,25.746462,,3,,,,,,,,,,,,
KE003,,Kenya,,,1,.32978966832161,2,32,,,1,0,,,65.7,1,158.6000061035156,1,26.119146,,3,,,,,,,,,,,,
KE004,,Kenya,,,1,.582716763019562,2,25,,,1,0,,,58.8,1,157,1,23.854923,,2,,,,,,,,,,,,
KE005,,Kenya,,,1,.582716763019562,2,32,,,1,2,,,74.2,1,164,1,27.587746,,3,,,,,,,,,,,,
KE006,,Kenya,,,1,1.24048590660095,2,30,,,1,2,,,47,1,151.8000030517578,1,20.396437,,2,,,,,,,,,,,,
KE007,,Kenya,,,1,1.24048590660095,2,47,,,1,0,,,80,1,155.5,1,33.084854,,4,,,,,,,,,,,,
KE008,,Kenya,,,1,1.57628619670868,2,35,,,1,0,,,46,1,142.1000061035156,1,22.780834,,2,,,,,,,,,,,,
KE009,,Kenya,,,1,.373330950737,2,40,,,1,0,,,53.1,1,153.5,1,22.536049,,2,,,,,,,,,,,,
KE010,,Kenya,,,1,.373330950737,2,22,,,2,2,,,46.8,1,157.5,1,18.866213,,2,,,,,,,,,,,,
KE011,,Kenya,,,1,.953884780406952,2,34,,,2,2,,,66,1,170.1999969482422,1,22.783731,,2,,,,,,,,,,,,
KE012,,Kenya,,,1,.953884780406952,2,23,,,2,0,,,56,1,160.6000061035156,1,21.711855,,2,,,,,,,,,,,,
KE013,,Kenya,,,1,.701655626296997,2,35,,,2,0,,,62,1,154.5,1,25.973755,,3,,,,,,,,,,,,
KE014,,Kenya,,,1,1.35133671760559,2,39,,,2,0,,,46,1,156.1000061035156,1,18.877827,,2,,,,,,,,,,,,
KE015,,Kenya,,,1,1.35133671760559,2,37,,,2,0,,,55,1,156,1,22.600264,,2,,,,,,,,,,,,
KE016,,Kenya,,,1,1.34698140621185,2,28,,,2,0,,,66,1,163.5,1,24.68928,,2,,,,,,,,,,,,
KE017,,Kenya,,,1,1.34698140621185,2,49,,,2,0,,,77.3,1,155.5,1,31.968239,,4,,,,,,,,,,,,
KE018,,Kenya,,,1,1.02735865116119,2,40,,,1,0,,,58.7,1,158.2,1,23.454445,,2,,,,,,,,,,,,
KE019,,Kenya,,,1,1.02735865116119,2,49,,,1,0,,,65.2,1,160,1,25.46875,,3,,,,,,,,,,,,
KE020,,Kenya,,,1,3.37126231193542,2,32,,,1,0,,,82.09999999999999,1,159.1999969482422,1,32.393436,,4,,,,,,,,,,,,
KE021,,Kenya,,,1,.344376266002655,2,39,,,1,0,,,46.8,1,152.199996948242,1,20.203033,,2,,,,,,,,,,,,
KE022,,Kenya,,,1,.344376266002655,2,35,,,1,0,,,67.3,1,164.8999938964844,1,24.74992,,2,,,,,,,,,,,,
KE023,,Kenya,,,1,1.33219242095947,2,26,,,1,2,,,61.9,1,152.3999938964844,1,26.651443,,3,,,,,,,,,,,,
KE024,,Kenya,,,1,.462612718343735,2,29,,,2,3,,,66,1,163.5,1,24.68928,,2,,,,,,,,,,,,
KE025,,Kenya,,,1,.7541144490242,2,40,,,2,0,,,75,1,164.6000061035156,1,27.682262,,3,,,,,,,,,,,,
KE026,,Kenya,,,1,.8997956514358521,2,27,,,2,2,,,65,1,145.6000061035156,1,30.661301,,4,,,,,,,,,,,,
KE027,,Kenya,,,1,.8997956514358521,2,29,,,2,0,,,67,1,160.6000061035156,1,25.976683,,3,,,,,,,,,,,,
KE028,,Kenya,,,1,.431790918111801,2,26,,,1,2,,,51,1,152.8999938964844,1,21.815001,,2,,,,,,,,,,,,
KE029,,Kenya,,,1,.453653752803802,2,30,,,1,0,,,79,1,174.1999969482422,1,26.033396,,3,,,,,,,,,,,,
KE030,,Kenya,,,1,.940101742744446,2,26,,,1,0,,,46,1,161.3000030517578,1,17.680277,,1,,,,,,,,,,,,
KE031,,Kenya,,,1,.940101742744446,2,26,,,1,0,,,72,1,164.9,1,26.478367,,3,,,,,,,,,,,,
KE032,,Kenya,,,1,.64319771528244,2,20,,,1,2,,,46,1,148.6000061035156,1,20.831482,,2,,,,,,,,,,,,
KE033,,Kenya,,,1,.419162571430206,2,35,,,1,0,,,91,1,164.39,1,33.673683,,4,,,,,,,,,,,,
KE034,,Kenya,,,1,.419162571430206,2,22,,,1,0,,,55,1,162.3000030517578,1,20.879766,,2,,,,,,,,,,,,
KE035,,Kenya,,,1,1.46947801113129,2,29,,,1,1,,,70.2,1,,,,,,,,,,,,,,,,298,
KE036,,Kenya,,,1,1.46947801113129,2,43,,,1,0,,,84.2,1,159,1,33.305645,,4,,,,,,,,,,,,
KE037,,Kenya,,,1,1.08522510528564,2,29,,,1,2,,,45.6,1,150.8000030517578,1,20.052206,,2,,,,,,,,,,,,
KE038,,Kenya,,,1,1.48314106464386,2,26,,,1,2,,,44.4,1,163.899993896484,1,16.528183,,1,,,,,,,,,,,,
KE039,,Kenya,,,1,1.48314106464386,2,24,,,2,2,,,45.6,1,161.3000030517578,1,17.526537,,1,,,,,,,,,,,,
KE040,,Kenya,,,1,.832005977630615,2,28,,,2,0,,,50,1,147,1,23.138508,,2,,,,,,,,,,,,
KE041,,Kenya,,,1,.359761655330658,2,19,,,2,2,,,48.7,1,154,1,,,,,,,,,,,,,20.53466,,
KE042,,Kenya,,,1,.524599134922028,2,25,,,2,0,,,58,1,160.3999938964844,1,22.543394,,2,,,,,,,,,,,,
KE043,,Kenya,,,1,.524599134922028,2,36,,,2,0,,,60.3,1,167.6000061035156,1,21.466896,,2,,,,,,,,,,,,
KE044,,Kenya,,,1,.589847803115845,2,17,,,2,2,,,46.3,1,159.5,1,,,,,,,,,,,,,18.199507,,
KE045,,Kenya,,,1,.190526068210602,2,17,,,1,0,,,56.6,1,159.5,1,,,,,,,,,,,,,22.248209,,
KE046,,Kenya,,,1,.190526068210602,2,49,,,1,0,,,60.6,1,157.1999969482422,1,24.522659,,2,,,,,,,,,,,,
KE047,,Kenya,,,1,.884229719638824,2,35,,,1,0,,,58.4,1,161.1000061035156,1,22.502031,,2,,,,,,,,,,,,
KE048,,Kenya,,,1,.884229719638824,2,45,,,1,0,,,51.6,1,147.5,1,23.717323,,2,,,,,,,,,,,,
KE049,,Kenya,,,1,.277589738368988,2,35,,,1,2,,,52.6,1,151.1000061035156,1,23.038637,,2,,,,,,,,,,,,
KE050,,Kenya,,,1,.277589738368988,2,27,,,1,0,,,63,1,164.3,1,23.338097,,2,,,,,,,,,,,,
KE051,,Kenya,,,1,.679516553878784,2,40,,,1,0,,,53.1,1,164,1,19.742712,,2,,,,,,,,,,,,
KE052,,Kenya,,,1,.8501185774803161,2,22,,,1,2,,,43,1,162.3999938964844,1,16.304085,,1,,,,,,,,,,,,
KE053,,Kenya,,,1,.8501185774803161,2,30,,,1,0,,,41,1,144,1,19.772377,,2,,,,,,,,,,,,
KE054,,Kenya,,,1,.429531335830688,2,26,,,1,2,,,42.8,1,152.3000030517578,1,18.452021,,1,,,,,,,,,,,,
KE055,,Kenya,,,1,.429531335830688,2,31,,,1,1,,,58,1,,,,,,,,,,,,,,,,274,
KE056,,Kenya,,,1,.782235980033875,2,25,,,1,2,,,37.9,1,150.3000030517578,1,16.777267,,1,,,,,,,,,,,,
KE057,,Kenya,,,1,.649535238742828,2,24,,,1,2,,,50.5,1,153.1999969482422,1,21.516611,,2,,,,,,,,,,,,
KE058,,Kenya,,,1,.335511535406113,2,41,,,2,0,,,61.7,1,160.1999969482422,1,24.041422,,2,,,,,,,,,,,,
KE059,,Kenya,,,1,.335511535406113,2,45,,,2,0,,,59.4,1,156.1999969482422,1,24.345819,,2,,,,,,,,,,,,
KE060,,Kenya,,,1,1.00305604934692,2,16,,,2,0,,,43.7,1,155.6000061035156,1,,,,,,,,,,,,,18.049377,,
KE061,,Kenya,,,1,1.00305604934692,2,23,,,2,0,,,45.9,1,157.1999969482422,1,18.574093,,2,,,,,,,,,,,,
KE062,,Kenya,,,1,1.40512490272522,2,22,,,1,2,,,72.40000000000001,1,152.1000061035156,1,31.29537,,4,,,,,,,,,,,,
KE063,,Kenya,,,1,.6279199719429021,2,39,,,1,2,,,44.6,1,162.1000061035156,1,16.973398,,1,,,,,,,,,,,,
KE064,,Kenya,,,1,2.99290728569031,2,25,,,1,0,,,44.1,1,164.8999938964844,1,16.218,,1,,,,,,,,,,,,
KE065,,Kenya,,,1,2.10438799858093,2,36,,,1,2,,,66,1,167.1000061035156,1,23.636927,,2,,,,,,,,,,,,
KE066,,Kenya,,,1,2.10438799858093,2,23,,,1,2,,,56,1,166.5,1,20.20038,,2,,,,,,,,,,,,
KE067,,Kenya,,,1,.911811411380768,2,30,,,1,2,,,62,1,163.1000061035156,1,23.306858,,2,,,,,,,,,,,,
KE068,,Kenya,,,1,.911811411380768,2,24,,,1,2,,,46,1,159.3,1,18.127014,,1,,,,,,,,,,,,
KE069,,Kenya,,,1,1.0197890996933,2,36,,,1,0,,,55,1,152.1999969482422,1,23.74288,,2,,,,,,,,,,,,
KE070,,Kenya,,,1,.311935484409332,2,44,,,2,0,,,66,1,168.5,1,23.245781,,2,,,,,,,,,,,,
KE071,,Kenya,,,1,.311935484409332,2,27,,,1,0,,,77.3000030517578,1,177.6999969482422,1,24.47962,,2,,,,,,,,,,,,
KE072,,Kenya,,,1,.767841160297394,2,23,,,1,0,,,64.2,1,161,1,24.767563,,2,,,,,,,,,,,,
KE073,,Kenya,,,1,.767841160297394,2,27,,,1,2,,,55.2,1,152.1000061035156,1,23.860559,,2,,,,,,,,,,,,
KE074,,Kenya,,,1,.233159378170967,2,15,,,1,0,,,42,1,159.3000030517578,1,,,,,,,,,,,,,16.550751,,
KE075,,Kenya,,,1,1.22448682785034,2,42,,,2,0,,,84.2,1,159,1,33.305645,,4,,,,,,,,,,,,
KE076,,Kenya,,,1,1.23270285129547,2,35,,,1,2,,,51.4,1,161.1000061035156,1,19.804871,,2,,,,,,,,,,,,
KE077,,Kenya,,,1,.409350395202637,2,22,,,1,2,,,46,1,145.8999938964844,1,21.609627,,2,,,,,,,,,,,,
KE078,,Kenya,,,1,.646706342697144,2,25,,,2,2,,,47.3,1,159,1,18.709703,,2,,,,,,,,,,,,
KE079,,Kenya,,,1,.646706342697144,2,36,,,1,2,,,45.1,1,167.1000061035156,1,16.151899,,1,,,,,,,,,,,,
KE080,,Kenya,,,1,.285429030656815,2,17,,,1,1,,,56,1,,,,,,,,,,,,,,,,274,
KE081,,Kenya,,,1,.285429030656815,2,43,,,1,0,,,44.4,1,157.1000061035156,1,17.989975,,1,,,,,,,,,,,,
KE082,,Kenya,,,1,1.39720499515533,2,35,,,1,2,,,53.6,1,152.1999969482422,1,23.138515,,2,,,,,,,,,,,,
KE083,,Kenya,,,1,1.39720499515533,2,37,,,1,1,,,49,1,,,,,,,,,,,,,,,,236,
KE084,,Kenya,,,1,.922155320644379,2,28,,,1,0,,,70.2,1,161.5,1,26.914856,,3,,,,,,,,,,,,
KE085,,Kenya,,,1,.0983298942446709,2,19,,,1,0,,,61.6,1,163.1000061035156,1,,,,,,,,,,,,,23.156492,,
KE086,,Kenya,,,1,.165120005607605,2,25,,,1,2,,,46,1,159.3,1,18.127014,,1,,,,,,,,,,,,
KE087,,Kenya,,,1,.165120005607605,2,30,,,1,0,,,72,1,164.5,1,26.607292,,3,,,,,,,,,,,,
KE088,,Kenya,,,1,2.40479588508606,2,30,,,1,0,,,64.40000000000001,1,177.1000061035156,1,20.532825,,2,,,,,,,,,,,,
KE089,,Kenya,,,1,.801598608493805,2,45,,,1,0,,,51.6,1,147.5,1,23.717323,,2,,,,,,,,,,,,
KE090,,Kenya,,,1,.801598608493805,2,23,,,1,2,,,62.1,1,159.8000030517578,1,24.318569,,2,,,,,,,,,,,,
KE091,,Kenya,,,1,3.66100287437439,2,38,,,1,2,,,64.5,1,166.5,1,23.26651,,2,,,,,,,,,,,,
KE092,,Kenya,,,1,3.19427061080933,2,22,,,1,1,,,53.7,1,,,,,,,,,,,,,,,,257,
KE093,,Kenya,,,1,.486664980649948,2,45,,,1,0,,,65.40000000000001,1,164.5,1,24.168291,,2,,,,,,,,,,,,
KE094,,Kenya,,,1,.486664980649948,2,26,,,1,2,,,57.7,1,163.1000061035156,1,21.690414,,2,,,,,,,,,,,,
KE095,,Kenya,,,1,.155196309089661,2,20,,,1,1,,,36,1,,,,,,,,,,,,,,,,224,
KE096,,Kenya,,,1,.37866422533989,2,20,,,2,2,,,60,1,172,1,20.281233,,2,,,,,,,,,,,,
KE097,,Kenya,,,1,.37866422533989,2,40,,,2,2,,,65.2,1,170.1999969482422,1,22.507565,,2,,,,,,,,,,,,
KE098,,Kenya,,,1,.551197350025177,2,17,,,2,0,,,45.4,1,157,1,,,,,,,,,,,,,18.418596,,
KE099,,Kenya,,,1,.35499769449234,2,27,,,2,0,,,52.3,1,160.1999969482422,1,20.37871,,2,,,,,,,,,,,,
KE100,,Kenya,,,1,.88026487827301,2,15,,,2,0,,,47,1,155.1999969482422,1,,,,,,,,,,,,,19.512569,,
KE101,,Kenya,,,1,.88026487827301,2,38,,,2,0,,,56,1,153,1,23.922422,,2,,,,,,,,,,,,
KE102,,Kenya,,,1,2.31477046012878,2,23,,,2,2,,,52.8,1,161.5,1,20.243652,,2,,,,,,,,,,,,
KE103,,Kenya,,,1,1.65469181537628,2,38,,,2,0,,,72.40000000000001,1,166.3,1,26.179062,,3,,,,,,,,,,,,
KE104,,Kenya,,,1,1.65469181537628,2,20,,,1,2,,,53.6,1,164.5,1,19.807652,,2,,,,,,,,,,,,
KE105,,Kenya,,,1,1.52155578136444,2,43,,,1,0,,,65.09999999999999,1,162.3000030517578,1,24.71405,,2,,,,,,,,,,,,
KE106,,Kenya,,,1,1.52155578136444,2,35,,,1,1,,,88,1,,,,,,,,,,,,,,,,380,
KE107,,Kenya,,,1,.904172539710999,2,28,,,1,0,,,53.5,1,156,1,21.983892,,2,,,,,,,,,,,,
KE108,,Kenya,,,1,.904172539710999,2,32,,,1,2,,,85.2,1,163.1000061035156,1,32.028133,,4,,,,,,,,,,,,
KE109,,Kenya,,,1,2.55688142776489,2,23,,,1,0,,,53.7,1,163.5,1,20.088097,,2,,,,,,,,,,,,
KE110,,Kenya,,,1,1.62794876098633,2,28,,,1,2,,,49.8,1,152.1999969482422,1,21.498098,,2,,,,,,,,,,,,
KE111,,Kenya,,,1,1.62794876098633,2,33,,,1,2,,,51.5,1,177.6999969482422,1,16.309191,,1,,,,,,,,,,,,
KE112,,Kenya,,,1,1.55325353145599,2,29,,,1,2,,,67.2,1,161.5,1,25.764648,,3,,,,,,,,,,,,
KE113,,Kenya,,,1,.704182505607605,2,23,,,1,1,,,46,1,,,,,,,,,,,,,,,,248,
KE114,,Kenya,,,1,.704182505607605,2,30,,,1,2,,,46,1,164.3999938964844,1,17.019791,,1,,,,,,,,,,,,
KE115,,Kenya,,,1,.170249029994011,2,25,,,2,2,,,42.5,1,152.1999969482422,1,18.346771,,1,,,,,,,,,,,,
KE116,,Kenya,,,1,.170249029994011,2,25,,,2,0,,,56.1,1,168.8000030517578,1,19.688742,,2,,,,,,,,,,,,
KE117,,Kenya,,,1,.304445326328278,2,35,,,2,2,,,60.3,1,167.5,1,21.492537,,2,,,,,,,,,,,,
KE118,,Kenya,,,1,.304445326328278,2,25,,,2,2,,,57.9,1,162,1,22.062185,,2,,,,,,,,,,,,
KE119,,Kenya,,,1,1.20175790786743,2,24,,,2,2,,,48.4,1,161.5,1,18.556681,,2,,,,,,,,,,,,
KE120,,Kenya,,,1,1.16401624679565,2,22,,,2,2,,,59.7,1,168.5,1,21.026865,,2,,,,,,,,,,,,
KE121,,Kenya,,,1,1.16401624679565,2,30,,,2,2,,,53.9,1,158.1999969482422,1,21.536535,,2,,,,,,,,,,,,
KE122,,Kenya,,,1,.398451030254364,2,33,,,2,0,,,62.1,1,160.1000061035156,1,24.227516,,2,,,,,,,,,,,,
KE123,,Kenya,,,1,.398451030254364,2,27,,,1,0,,,50,1,155.8000030517578,1,20.598476,,2,,,,,,,,,,,,
KE124,,Kenya,,,1,.467149496078491,2,18,,,1,2,,,63.8,1,173.5,1,,,,,,,,,,,,,21.194429,,
KE125,,Kenya,,,1,.467149496078491,2,35,,,1,0,,,44.9,1,158.8999938964844,1,17.782736,,1,,,,,,,,,,,,
KE126,,Kenya,,,1,.168311208486557,2,30,,,1,0,,,52,1,156.3,1,21.285576,,2,,,,,,,,,,,,
KE127,,Kenya,,,1,.114220693707466,2,30,,,1,0,,,53.9,1,162.8999938964844,1,20.311716,,2,,,,,,,,,,,,
KE128,,Kenya,,,1,1.42417550086975,2,33,,,1,2,,,76,1,162.3000030517578,1,28.852041,,3,,,,,,,,,,,,
KE129,,Kenya,,,1,2.40815138816834,2,30,,,1,0,,,50.2,1,165.5,1,18.32769,,1,,,,,,,,,,,,
KE130,,Kenya,,,1,.767112731933594,2,43,,,1,0,,,64.8,1,158.3999938964844,1,25.826448,,3,,,,,,,,,,,,
KE131,,Kenya,,,1,1.56769692897797,2,30,,,1,2,,,64.40000000000001,1,177.1000061035156,1,20.532825,,2,,,,,,,,,,,,
KE132,,Kenya,,,1,4.2165641784668,2,35,,,1,0,,,44.9,1,158.8999938964844,1,17.782736,,1,,,,,,,,,,,,
KE133,,Kenya,,,1,.6505557894706731,2,28,,,1,0,,,76.59999999999999,1,167.3999938964844,1,27.334925,,3,,,,,,,,,,,,
KE134,,Kenya,,,1,.6505557894706731,2,45,,,1,0,,,45.1,1,153.8000030517578,1,19.066187,,2,,,,,,,,,,,,
KE135,,Kenya,,,1,.666758298873901,2,16,,,1,2,,,55.3,1,158,1,,,,,,,,,,,,,22.151899,,
KE136,,Kenya,,,1,.955457746982574,2,48,,,1,0,,,65.5,1,155,1,27.263268,,3,,,,,,,,,,,,
KE137,,Kenya,,,1,2.12683415412903,2,21,,,2,0,,,53.9,1,164.5,1,19.918514,,2,,,,,,,,,,,,
KE138,,Kenya,,,1,3.36867690086365,2,31,,,2,0,,,53.3,1,161,1,20.562479,,2,,,,,,,,,,,,
KE139,,Kenya,,,1,.144173309206963,2,32,,,2,0,,,54.5,1,164.5,1,20.140244,,2,,,,,,,,,,,,
KE140,,Kenya,,,1,.144173309206963,2,19,,,2,1,,,57,1,,,,,,,,,,,,,,,,224,
KE141,,Kenya,,,1,.519023954868317,2,22,,,2,2,,,52.7,1,163,1,19.835146,,2,,,,,,,,,,,,
KE142,,Kenya,,,1,.519023954868317,2,35,,,2,1,,,58,1,,,,,,,,,,,,,,,,254,
KE143,,Kenya,,,1,.921259045600891,2,41,,,2,0,,,50,1,125.5,1,31.745527,,4,,,,,,,,,,,,
KE144,,Kenya,,,1,.506936192512512,2,23,,,2,2,,,59.5,1,154,1,25.088549,,3,,,,,,,,,,,,
KE145,,Kenya,,,1,.393503606319427,2,15,,,2,1,,,41.8,1,,,,,,,,,,,,,,,,204,
KE146,,Kenya,,,1,.393503606319427,2,40,,,2,0,,,50.7,1,156,1,20.833334,,2,,,,,,,,,,,,
KE147,,Kenya,,,1,1.53903639316559,2,47,,,1,0,,,62.8,1,164.3000030517578,1,23.264006,,2,,,,,,,,,,,,
KE148,,Kenya,,,1,1.13102853298187,2,28,,,1,1,,,61.2,1,,,,,,,,,,,,,,,,265,
KE149,,Kenya,,,1,1.13102853298187,2,38,,,1,2,,,57.2,1,151.6999969482422,1,24.855637,,2,,,,,,,,,,,,
KE150,,Kenya,,,1,.210331618785858,2,20,,,1,0,,,51.2,1,161.267291,1,19.686901,,2,,,,,,,,,,,,
KE151,,Kenya,,,1,.210331618785858,2,38,,,1,2,,,59.3,1,168,1,21.010487,,2,,,,,,,,,,,,
KE152,,Kenya,,,1,1.00122129917145,2,20,,,1,0,,,56.5,1,163.5,1,21.135519,,2,,,,,,,,,,,,
KE153,,Kenya,,,1,1.00122129917145,2,25,,,1,2,,,48.7,1,151.6000061035156,1,21.18998,,2,,,,,,,,,,,,
KE154,,Kenya,,,1,2.80562019348145,2,25,,,1,2,,,45.4,1,151.3999938964844,1,19.806335,,2,,,,,,,,,,,,
KE155,,Kenya,,,1,.261556327342987,2,17,,,1,0,,,67.7,1,164,1,,,,,,,,,,,,,25.17103,,
KE156,,Kenya,,,1,.322643488645554,2,30,,,2,0,,,53.3,1,161,1,20.562479,,2,,,,,,,,,,,,
KE157,,Kenya,,,1,.322643488645554,2,45,,,2,0,,,63.9,1,157,1,25.923973,,3,,,,,,,,,,,,
KE158,,Kenya,,,1,.216816425323486,2,24,,,2,0,,,53.2,1,155.5,1,22.001427,,2,,,,,,,,,,,,
KE159,,Kenya,,,1,1.08297836780548,2,38,,,2,2,,,60.1,1,162,1,22.900473,,2,,,,,,,,,,,,
KE160,,Kenya,,,1,1.08297836780548,2,19,,,2,1,,,55.1,1,,,,,,,,,,,,,,,,260,
KE161,,Kenya,,,1,.641971707344055,2,32,,,1,2,,,76.40000000000001,1,163,1,28.755316,,3,,,,,,,,,,,,
KE162,,Kenya,,,1,.641971707344055,2,18,,,1,2,,,60.2,1,160.5,1,,,,,,,,,,,,,23.369339,,
KE163,,Kenya,,,1,.339128524065018,2,48,,,1,0,,,65.5,1,163,1,24.65279,,2,,,,,,,,,,,,
KE164,,Kenya,,,1,.339128524065018,2,20,,,1,2,,,53.4,1,167.5,1,19.033192,,2,,,,,,,,,,,,
KE165,,Kenya,,,1,2.10292267799377,2,19,,,1,0,,,62.2,1,173,1,,,,,,,,,,,,,20.782518,,
KE166,,Kenya,,,1,.746696770191193,2,21,,,1,1,,,60,1,,,,,,,,,,,,,,,,246,
KE167,,Kenya,,,1,.746696770191193,2,29,,,1,2,,,64,1,161.5,1,24.53776,,2,,,,,,,,,,,,
KE168,,Kenya,,,1,.526770234107971,2,24,,,1,2,,,56.4,1,163.1000061035156,1,21.201723,,2,,,,,,,,,,,,
KE169,,Kenya,,,1,1.20578980445862,2,25,,,1,2,,,51.3,1,159.6999969482422,1,20.114422,,2,,,,,,,,,,,,
KE170,,Kenya,,,1,1.20578980445862,2,32,,,1,0,,,41.4,1,152.1999969482422,1,17.871914,,1,,,,,,,,,,,,
KE171,,Kenya,,,1,.31432980298996,2,32,,,2,0,,,50.3,1,157,1,20.406507,,2,,,,,,,,,,,,
KE172,,Kenya,,,1,.31432980298996,2,23,,,2,2,,,49.5,1,155.5,1,20.471252,,2,,,,,,,,,,,,
KE173,,Kenya,,,1,.6921736001968381,2,22,,,2,3,,,60.1,1,,,,,,,,,,,,,,,,231,
KE174,,Kenya,,,1,.6921736001968381,2,37,,,1,0,,,62.8,1,159.300003051757,1,24.747314,,2,,,,,,,,,,,,
KE175,,Kenya,,,1,.299423426389694,2,25,,,1,1,,,56.7,1,,,,,,,,,,,,,,,,247,
KE176,,Kenya,,,1,.299423426389694,2,30,,,1,2,,,57.7,1,152.100006103515,1,24.9412,,2,,,,,,,,,,,,
KE177,,Kenya,,,1,2.75468230247498,2,24,,,1,2,,,52.3,1,154.3999938964844,1,21.938511,,2,,,,,,,,,,,,
KE178,,Kenya,,,1,2.75468230247498,2,41,,,1,0,,,58.6,1,171.3000030517578,1,19.970221,,2,,,,,,,,,,,,
KE179,,Kenya,,,1,1.09400701522827,2,32,,,1,0,,,67.8,1,159.1000061035156,1,26.784855,,3,,,,,,,,,,,,
KE180,,Kenya,,,1,.364669024944305,2,36,,,1,0,,,53.4,1,157.3999938964844,1,21.554195,,2,,,,,,,,,,,,
KE181,,Kenya,,,1,.880235552787781,2,16,,,1,0,,,56.9,1,161.5,1,,,,,,,,,,,,,21.815603,,
KE182,,Kenya,,,1,.880235552787781,2,32,,,2,2,,,49.1,1,150.3000030517578,1,21.735193,,2,,,,,,,,,,,,
KE183,,Kenya,,,1,2.28315329551697,2,27,,,2,2,,,49.9,1,158.5,1,19.862871,,2,,,,,,,,,,,,
KE184,,Kenya,,,1,1.84743702411652,2,28,,,2,0,,,52.8,1,161.3000030517578,1,20.293884,,2,,,,,,,,,,,,
KE185,,Kenya,,,1,1.84743702411652,2,40,,,2,0,,,58.7,1,158.1999969482422,1,23.454445,,2,,,,,,,,,,,,
KE186,,Kenya,,,1,2.84696435928345,2,25,,,2,1,,,52.4,1,,,,,,,,,,,,,,,,247,
KE187,,Kenya,,,1,2.84696435928345,2,30,,,2,1,,,66,1,,,,,,,,,,,,,,,,265,
KE188,,Kenya,,,1,.465500384569168,2,45,,,2,0,,,53.3,1,154.6000061035156,1,22.300171,,2,,,,,,,,,,,,
KE189,,Kenya,,,1,.465500384569168,2,44,,,2,0,,,52.4,1,156.5,1,21.394524,,2,,,,,,,,,,,,
KE190,,Kenya,,,1,.7958554625511171,2,20,,,2,0,,,58.6,1,148.5,1,26.573252,,3,,,,,,,,,,,,
KE191,,Kenya,,,1,.669301629066467,2,15,,,2,0,,,38.6,1,152.1999969482422,1,,,,,,,,,,,,,16.663185,,
KE192,,Kenya,,,1,2.16363334655762,2,24,,,2,2,,,56.9,1,161,1,21.951313,,2,,,,,,,,,,,,
KE193,,Kenya,,,1,2.16363334655762,2,40,,,1,1,,,57,1,,,,,,,,,,,,,,,,262,
KE194,,Kenya,,,1,.326350867748261,2,45,,,1,0,,,67.09999999999999,1,154.3000030517578,1,28.183222,,3,,,,,,,,,,,,
KE195,,Kenya,,,1,1.84201204776764,2,23,,,1,2,,,53,1,159.5,1,20.833128,,2,,,,,,,,,,,,
KE196,,Kenya,,,1,2.51576638221741,2,30,,,1,0,,,49.9,1,158.5,1,19.862871,,2,,,,,,,,,,,,
KE197,,Kenya,,,1,1.15179669857025,2,35,,,1,0,,,52.6,1,167.8999938964844,1,18.658829,,2,,,,,,,,,,,,
KE198,,Kenya,,,1,1.87924718856812,2,18,,,1,2,,,60.2,1,160.5,1,,,,,,,,,,,,,23.369339,,
KE199,,Kenya,,,1,1.87924718856812,2,30,,,1,2,,,78.2,1,162,1,29.797287,,3,,,,,,,,,,,,
KE200,,Kenya,,,1,1.2713143825531,2,43,,,1,0,,,52.3,1,154.3999938964844,1,21.938511,,2,,,,,,,,,,,,
KE201,,Kenya,,,1,1.2713143825531,2,23,,,1,2,,,68.3,1,170.8000030517578,1,23.412348,,2,,,,,,,,,,,,
KE202,,Kenya,,,1,.854269444942474,2,23,,,2,2,,,53.4,1,168.6000061035156,1,18.785645,,2,,,,,,,,,,,,
KE203,,Kenya,,,1,.854269444942474,2,18,,,2,2,,,61.5,1,170.3999938964844,1,,,,,,,,,,,,,21.180489,,
KE204,,Kenya,,,1,.746644973754883,2,16,,,2,1,,,61,1,,,,,,,,,,,,,,,,248,
KE205,,Kenya,,,1,3.73652482032776,2,46,,,2,0,,,65.5,1,163,1,24.65279,,2,,,,,,,,,,,,
KE206,,Kenya,,,1,.335371315479279,2,40,,,2,0,,,54.5,1,151,1,23.90246,,2,,,,,,,,,,,,
KE207,,Kenya,,,1,.335371315479279,2,38,,,2,0,,,71,1,162.5,1,26.887573,,3,,,,,,,,,,,,
KE208,,Kenya,,,1,.83798623085022,2,27,,,2,2,,,45.8,1,160.8000030517578,1,17.713051,,1,,,,,,,,,,,,
KE209,,Kenya,,,1,.83798623085022,2,43,,,2,0,,,53,1,151.8000030517578,1,23.000237,,2,,,,,,,,,,,,
KE210,,Kenya,,,1,1.56126236915588,2,39,,,1,1,,,55,1,,,,,,,,,,,,,,,,248,
KE211,,Kenya,,,1,1.56126236915588,2,17,,,1,1,,,51.8,1,161.6000061035156,1,,,,,,,,,,,,,19.835676,,
KE212,,Kenya,,,1,.92359983921051,2,22,,,1,3,,,57.6,1,,,,,,,,,,,,,,,,225,
KE213,,Kenya,,,1,.92359983921051,2,31,,,1,2,,,65.90000000000001,1,170,1,22.802769,,2,,,,,,,,,,,,
KE214,,Kenya,,,1,4.10488796234131,2,23,,,1,0,,,62.1,1,164.3000030517578,1,23.004694,,2,,,,,,,,,,,,
KE215,,Kenya,,,1,.718355417251587,2,15,,,1,0,,,75.59999999999999,1,175.6000061035156,1,,,,,,,,,,,,,24.517305,,
KE216,,Kenya,,,1,.718355417251587,2,25,,,1,0,,,63.8,1,173.5,1,21.194429,,2,,,,,,,,,,,,
KE217,,Kenya,,,1,2.2949104309082,2,28,,,1,0,,,45.6,1,150.8000030517578,1,20.052206,,2,,,,,,,,,,,,
KE218,,Kenya,,,1,2.2949104309082,2,24,,,1,2,,,36.7,1,190,1,10.166205,,1,,,,,,,,,,,,
KE219,,Kenya,,,1,.221182733774185,2,18,,,1,2,,,41.8,1,158.8000030517578,1,,,,,,,,,,,,,16.575829,,
KE220,,Kenya,,,1,.336279898881912,2,21,,,1,2,,,40.1,1,150.3999938964844,1,17.727551,,1,,,,,,,,,,,,
KE221,,Kenya,,,1,.336279898881912,2,34,,,1,1,,,52.20000076293945,1,,,,,,,,,,,,,,,,271,
KE222,,Kenya,,,1,.441367357969284,2,23,,,1,2,,,52.2,1,163.6999969482422,1,19.479292,,2,,,,,,,,,,,,
KE223,,Kenya,,,1,.441367357969284,2,29,,,2,0,,,43.3,1,154.6000061035156,1,18.116274,,1,,,,,,,,,,,,
KE224,,Kenya,,,1,.842200994491577,2,30,,,2,0,,,62.8,1,167.8000030517578,1,22.303638,,2,,,,,,,,,,,,
KE225,,Kenya,,,1,4.27239751815796,2,21,,,2,0,,,45.5,1,145.6000061035156,1,21.46291,,2,,,,,,,,,,,,
KE226,,Kenya,,,1,4.27239751815796,2,15,,,2,0,,,53.1,1,159.8000030517578,1,,,,,,,,,,,,,20.79414,,
KE227,,Kenya,,,1,1.15500509738922,2,30,,,2,1,,,70,1,,,,,,,,,,,,,,,,252,
KE228,,Kenya,,,1,.650525450706482,2,33,,,2,2,,,63.3,1,168.800003051757,1,22.215639,,2,,,,,,,,,,,,
KE229,,Kenya,,,1,.650525450706482,2,45,,,2,2,,,45.3,1,154.1999969482422,1,19.051514,,2,,,,,,,,,,,,
KE230,,Kenya,,,1,.322888791561127,2,37,,,2,2,,,62,1,156.4,1,25.346512,,3,,,,,,,,,,,,
KE231,,Kenya,,,1,.285573810338974,2,21,,,2,0,,,48.9,1,152.6999969482422,1,20.971563,,2,,,,,,,,,,,,
KE232,,Kenya,,,1,.285573810338974,2,28,,,2,0,,,45,1,160.3000030517578,1,17.512392,,1,,,,,,,,,,,,
KE233,,Kenya,,,1,.231459870934486,2,43,,,2,2,,,48.1,1,155.6000061035156,1,19.866705,,2,,,,,,,,,,,,
KE234,,Kenya,,,1,.231459870934486,2,26,,,1,0,,,59.5,1,154,1,25.088549,,3,,,,,,,,,,,,
KE235,,Kenya,,,1,1.5184760093689,2,28,,,1,2,,,58.8,1,158.8000030517578,1,23.317196,,2,,,,,,,,,,,,
KE236,,Kenya,,,1,1.5184760093689,2,31,,,1,2,,,58.1,1,166.5,1,20.957895,,2,,,,,,,,,,,,
KE237,,Kenya,,,1,1.07366967201233,2,15,,,1,0,,,50.20000076293945,1,158.3000030517578,1,,,,,,,,,,,,,20.03281,,
KE238,,Kenya,,,1,1.07366967201233,2,19,,,1,2,,,53.3,1,154.6000061035156,1,,,,,,,,,,,,,22.300171,,
KE239,,Kenya,,,1,3.92613434791565,2,21,,,1,2,,,43.7,1,154.6000061035156,1,18.28363,,1,,,,,,,,,,,,
KE240,,Kenya,,,1,3.92613434791565,2,30,,,1,2,,,71.7,1,170.600006103515,1,24.635483,,2,,,,,,,,,,,,
KE241,,Kenya,,,1,1.23585617542267,2,20,,,1,0,,,68.5,1,158.2,1,27.370178,,3,,,,,,,,,,,,
KE242,,Kenya,,,1,1.56720900535584,2,46,,,1,2,,,50.40000152587891,1,161.5,1,19.323486,,2,,,,,,,,,,,,
KE243,,Kenya,,,1,1.56720900535584,2,36,,,1,0,,,61.4,1,162.399993896484,1,23.280718,,2,,,,,,,,,,,,
KE244,,Kenya,,,1,1.50452065467834,2,41,,,1,0,,,55.2,1,166.300003051757,1,19.959726,,2,,,,,,,,,,,,
KE245,,Kenya,,,1,1.50452065467834,2,43,,,1,0,,,66.09999999999999,1,156.199996948242,1,27.091898,,3,,,,,,,,,,,,
KE246,,Kenya,,,1,.785226821899414,2,48,,,1,0,,,75.59999999999999,1,175.6000061035156,1,24.517305,,2,,,,,,,,,,,,
KE247,,Kenya,,,1,.785226821899414,2,36,,,1,0,,,62.2,1,164.1999969482422,1,23.069815,,2,,,,,,,,,,,,
KE248,,Kenya,,,1,1.27615582942963,2,28,,,1,2,,,70,1,170.6000061035156,1,24.051378,,2,,,,,,,,,,,,
KE249,,Kenya,,,1,1.27615582942963,2,20,,,1,1,,,60,1,,,,,,,,,,,,,,,,246,
KE250,,Kenya,,,1,1.24049973487854,2,41,,,1,2,,,53.5,1,162.6,1,20.235443,,2,,,,,,,,,,,,
KE251,,Kenya,,,1,1.24049973487854,2,30,,,1,0,,,54.3,1,153.5,1,23.045338,,2,,,,,,,,,,,,
KE252,,Kenya,,,1,4.7687931060791,2,25,,,1,2,,,51.4,1,152.3999938964844,1,22.130602,,2,,,,,,,,,,,,
KE253,,Kenya,,,1,4.7687931060791,2,37,,,1,0,,,53.2,1,163.3000030517578,1,19.949833,,2,,,,,,,,,,,,
KE254,,Kenya,,,1,.814948678016663,2,18,,,2,0,,,57.5,1,168.5,1,,,,,,,,,,,,,20.252005,,
KE255,,Kenya,,,1,.0408635213971138,2,30,,,2,0,,,58.7,1,165.999993896484,1,21.302078,,2,,,,,,,,,,,,