id,sex,age,recall_n,recall_d,recall_m,recall_y,weekday,respondent,us_intake,consum_h,consum_min,meal_type,meal_place,eat_seq,food_type,rcp_code,rcp_descr,rcp_descr_eng,foodex2_rcp_code,foodex2_rcp_descr,rcp_amount,ingr_code,ingr_descr,ingr_descr_eng,foodex2_ingr_code,foodex2_ingr_descr,ingr_amount_unproc,ingr_amount_proc,energy,totalpro,animalpro,dairypro,plantpro,carb,adsugar,fiber,totalfat,sfa,mufa,pufa,water,n6,seafood_n3,plant_n3,tfa,chol,ca,fe,na,k,mg,zn,iod,se,ph,cu,vitb1,vitb2,vitb3,vitb6,fol,vitb12,vitc,vita,bcarot,vitd,vite,vitk,note
1,2,22,1,,8,2015,,1,,,,2,,2,3,10,"MAIZE, FLOUR, LIME-TREATED, COOKED, BLD",,,,248,335,"MAIZE, LIME TREATED, TOASTED",,A000T#F28.A07HC$F26.A07XE,"Maize grain, PROCESS = Toasting / coffee roasting, GENERIC-TERM = Other",,121.7,528,13.6,,,,110.8,,12.3,5.9000001,.70999998,1.41,2.54,,,,,,,416,3.4000001,,,,2.1199999,,,,,.20999999,.17,,.51999998,30,0,0,54,,,,,
1,2,22,1,,8,2015,,1,,,,2,,3,3,229,"SOUP/STEW, NIGHTSHADE (HIERBAMORA, MACUY, QUILETE), COOKED",,,,489,2,"AMARANTH/NIGHTSHADE (HIERBAMORA/MACUY/QUILETE) LEAVES, COOKED, BLD, WO/SALT, DRAINED",,A00ML#F28.A07GL$F10.A0CQE,"Amaranth leaves, PROCESS = Boiling, QUALITATIVE-INFO = Without added salt",,38.599998,8,.80000001,,,,1.6,,.89999998,.1,.02,.02,.029999999,,,,,,,81,.87,,,,.34,,,,,.0099999998,.050000001,,.07,22,0,15.88,54,,,,,
1,2,22,1,,8,2015,,1,,,,2,,3,3,229,"SOUP/STEW, NIGHTSHADE (HIERBAMORA, MACUY, QUILETE), COOKED",,,,489,219,"SALT, TABLE",,A042R,"Salt, iodised",,1.1,0,0,,,,0,,0,0,0,0,0,,,,,,,0,0,,,,0,,,,,0,0,,0,0,0,0,0,,,,,
1,2,22,1,,8,2015,,1,,,,2,,3,3,229,"SOUP/STEW, NIGHTSHADE (HIERBAMORA, MACUY, QUILETE), COOKED",,,,489,296,"TOMATOES, RED, RIPE, COOKED",,A0DMX#F28.A0BA1$F10.A0F2S$F10.A07XL,"Tomatoes, PROCESS = Cooking and similar thermal preparation processes, QUALITATIVE-INFO = Red, QUALITATIVE-INFO = Ripe / mature",,24.200001,4,.2,,,,1,,.2,0,0,0,.0099999998,,,,,,,3,.16,,,,.029999999,,,,,.0099999998,0,,.02,3,0,5.52,6,,,,,
1,2,22,1,,8,2015,,1,,,,2,,3,3,229,"SOUP/STEW, NIGHTSHADE (HIERBAMORA, MACUY, QUILETE), COOKED",,,,489,290,"ONIONS, COOKED, BLD/GRILLED, WO/SALT, NOT DRAINED",,A00HC#F28.A07GL$F28.A07GZ$F10.A0CQE$F26.A07XE,"Onions, PROCESS = Boiling, PROCESS = Broiling/grilling, QUALITATIVE-INFO = Without added salt, GENERIC-TERM = Other",,.89999998,0,0,,,,.1,,0,0,0,0,0,,,,,,,0,0,,,,0,,,,,0,0,,0,0,0,.050000001,0,,,,,
1,2,22,1,,8,2015,,1,,,,2,,3,3,229,"SOUP/STEW, NIGHTSHADE (HIERBAMORA, MACUY, QUILETE), COOKED",,,,489,300,"SOUP, CHICKEN BROTH OR BOUILLON, DRY",,A043G,"Stock cubes or granulate, chicken",,14.5,39,2.4000001,,,,2.5999999,,0,2,.5,.77999997,.64999998,,,,,,,27,.15000001,,,,.0099999998,,,,,.0099999998,.059999999,,.0099999998,5,.039999999,.16,0,,,,,
1,2,22,1,,8,2015,,1,,,,2,,1,3,263,"BEVERAGE, COFFEE, BREWED FROM GROUNDS, W/SUGAR AND WATER",,,,200,260,"SUGAR WHITE, GRANULATED FORTIFIED W/VIT A",,A032J#F09.A0EXZ$F03.A06JC,"White sugar, FORTIFICATION-AGENT = Vitamin A     (retinol, carotenoids), PHYSICAL-STATE = Fragments / granules / splinters",,17,66,0,,,,17,,0,0,0,0,0,,,,,,,0,.0099999998,,,,0,,,,,0,0,,0,0,0,0,254,,,,,
1,2,22,1,,8,2015,,1,,,,2,,1,3,263,"BEVERAGE, COFFEE, BREWED FROM GROUNDS, W/SUGAR AND WATER",,,,200,312,"COFFEE, BREWED PREPARED W/WATER",,A03KA#F04.A03GN$F04.A03DK,"Coffee beverages, INGREDIENT = Coffee ground, roasted, INGREDIENT = Drinking water",,183,2,.2,,,,0,,0,0,0,.039999999,0,,,,,,,4,.02,,,,.039999999,,,,,.02,.15000001,,0,4,0,0,0,,,,,
1,2,22,1,,8,2015,,1,,,,4,,2,3,10,"MAIZE, FLOUR, LIME-TREATED, COOKED, BLD",,,,217,335,"MAIZE, LIME TREATED, TOASTED",,A000T#F28.A07HC$F26.A07XE,"Maize grain, PROCESS = Toasting / coffee roasting, GENERIC-TERM = Other",,106.5,462,11.9,,,,97,,10.8,5.1999998,.62,1.24,2.23,,,,,,,364,2.97,,,,1.85,,,,,.18000001,.15000001,,.46000001,26,0,0,47,,,,,
1,2,22,1,,8,2015,,1,,,,4,,1,3,47,"BEANS, BLACK, PUREE (NOT FRIED)",,,,122,290,"ONIONS, COOKED, BLD/GRILLED, WO/SALT, NOT DRAINED",,A00HC#F28.A07GL$F28.A07GZ$F10.A0CQE$F26.A07XE,"Onions, PROCESS = Boiling, PROCESS = Broiling/grilling, QUALITATIVE-INFO = Without added salt, GENERIC-TERM = Other",,2.8,1,0,,,,.30000001,,0,0,0,0,0,,,,,,,1,.0099999998,,,,0,,,,,0,0,,0,0,0,.16,0,,,,,
1,2,22,1,,8,2015,,1,,,,4,,1,3,47,"BEANS, BLACK, PUREE (NOT FRIED)",,,,122,219,"SALT, TABLE",,A042R,"Salt, iodised",,.89999998,0,0,,,,0,,0,0,0,0,0,,,,,,,0,0,,,,0,,,,,0,0,,0,0,0,0,0,,,,,
1,2,22,1,,8,2015,,1,,,,4,,1,3,47,"BEANS, BLACK, PUREE (NOT FRIED)",,,,122,292,"OIL, SUNFLOWER, LINOLEIC",,A037D#F26.A07XE,"Sunflower seed oil, edible, GENERIC-TERM = Other",,1.5,13,0,,,,0,,0,1.5,.15000001,.67000002,.58999997,,,,,,,0,0,,,,0,,,,,0,0,,0,0,0,0,0,,,,,
1,2,22,1,,8,2015,,1,,,,4,,1,3,47,"BEANS, BLACK, PUREE (NOT FRIED)",,,,122,289,"BEANS, BLACK, MATURE SEEDS, COOKED, BLD, WO/SALT",,A012B#F28.A07GL$F10.A0CQE$F10.A07XL$F10.A166Z,"Borlotti or other common beans (without pods), PROCESS = Boiling, QUALITATIVE-INFO = Without added salt, QUALITATIVE-INFO = Ripe / mature, QUALITATIVE-INFO = Black",,65.5,87,5.8000002,,,,15.5,,5.6999998,.40000001,.090000004,.029999999,.15000001,,,,,,,18,1.38,,,,.73000002,,,,,.16,.039999999,,.050000001,98,0,0,0,,,,,
1,2,22,1,,8,2015,,1,,,,4,,1,3,47,"BEANS, BLACK, PUREE (NOT FRIED)",,,,122,291,"EPAZOTE, COOKED, BLD",,A00XJ#F28.A07GL,"Epazote, PROCESS = Boiling",,.60000002,0,0,,,,0,,0,0,0,0,0,,,,,,,2,.0099999998,,,,.0099999998,,,,,0,0,,0,1,0,.02,0,,,,,
1,2,22,1,,8,2015,,1,,,,4,,3,3,108,"PORK, FRESH, LEAN&FAT, MARINATE (ADOBADA), COOKED AND BROILED",,,,128,200,"PORK, FRESH, LEAN&FAT, COOKED AND BROILED",,A01RG#F28.A07GG$F28.A07GZ$F20.A0F4T,"Pig fresh meat, PROCESS = Cooking in water, PROCESS = Broiling/grilling, PART-CONSUMED-ANALYSED = Including visible fat",,121.8,256,34.799999,,,,0,,0,11.9,4.4299998,5.4200001,.94,,,,,,,21,1.11,,,,3.02,,,,,1.12,.41,,.60000002,7,.88,.85000002,2,,,,,
1,2,22,1,,8,2015,,1,,,,4,,3,3,108,"PORK, FRESH, LEAN&FAT, MARINATE (ADOBADA), COOKED AND BROILED",,,,128,297,"SEA, SALT",,A042X,Sea salt,,2.5,0,0,,,,0,,0,0,0,0,0,,,,,,,1,0,,,,0,,,,,0,0,,0,0,0,0,0,,,,,
1,2,22,1,,8,2015,,1,,,,4,,3,3,108,"PORK, FRESH, LEAN&FAT, MARINATE (ADOBADA), COOKED AND BROILED",,,,128,294,"SEEDS, ANATTOTREE DRIED",,A018M#F28.A07KG,"Annatto seed, PROCESS = Drying (dehydration)",,2.4000001,9,.30000001,,,,1.8,,.1,.2,.039999999,.0099999998,.050000001,,,,,,,0,.11,,,,.029999999,,,,,.0099999998,0,,.029999999,2,0,0,1,,,,,
1,2,22,1,,8,2015,,1,,,,4,,3,3,108,"PORK, FRESH, LEAN&FAT, MARINATE (ADOBADA), COOKED AND BROILED",,,,128,300,"SOUP, CHICKEN BROTH OR BOUILLON, DRY",,A043G,"Stock cubes or granulate, chicken",,1.3,4,.2,,,,.2,,0,.2,.050000001,.07,.059999999,,,,,,,3,.0099999998,,,,0,,,,,0,.0099999998,,0,0,0,.0099999998,0,,,,,
1,2,22,1,,8,2015,,1,,,,6,,2,1,,,,,,,130,"EGGS, WHOLE, COOKED, PAN FRIED",,A032C#F28.A07GS,"Fried eggs, PROCESS = Pan frying / shallow frying",,91,178,12.4,,,,.80000001,,0,13.5,3.9300001,5.6199999,2.96,,,,,,,56,1.72,,,,1.26,,,,,.039999999,.46000001,,.16,46,.88,0,199,,,,,
1,2,22,1,,8,2015,,1,,,,6,,3,3,10,"MAIZE, FLOUR, LIME-TREATED, COOKED, BLD",,,,248,335,"MAIZE, LIME TREATED, TOASTED",,A000T#F28.A07HC$F26.A07XE,"Maize grain, PROCESS = Toasting / coffee roasting, GENERIC-TERM = Other",,121.7,528,13.6,,,,110.8,,12.3,5.9000001,.70999998,1.41,2.54,,,,,,,416,3.4000001,,,,2.1199999,,,,,.20999999,.17,,.51999998,30,0,0,54,,,,,
1,2,22,1,,8,2015,,1,,,,6,,4,3,48,"SOUP, BEANS, BLACK (50% BEANS)",,,,243,289,"BEANS, BLACK, MATURE SEEDS, COOKED, BLD, WO/SALT",,A012B#F28.A07GL$F10.A0CQE$F10.A07XL$F10.A166Z,"Borlotti or other common beans (without pods), PROCESS = Boiling, QUALITATIVE-INFO = Without added salt, QUALITATIVE-INFO = Ripe / mature, QUALITATIVE-INFO = Black",,123.4,163,10.9,,,,29.299999,,10.7,.69999999,.17,.059999999,.28,,,,,,,33,2.5899999,,,,1.38,,,,,.30000001,.07,,.090000004,184,0,0,0,,,,,
1,2,22,1,,8,2015,,1,,,,6,,4,3,48,"SOUP, BEANS, BLACK (50% BEANS)",,,,243,219,"SALT, TABLE",,A042R,"Salt, iodised",,1.6,0,0,,,,0,,0,0,0,0,0,,,,,,,0,.0099999998,,,,0,,,,,0,0,,0,0,0,0,0,,,,,
1,2,22,1,,8,2015,,1,,,,6,,4,3,48,"SOUP, BEANS, BLACK (50% BEANS)",,,,243,292,"OIL, SUNFLOWER, LINOLEIC",,A037D#F26.A07XE,"Sunflower seed oil, edible, GENERIC-TERM = Other",,2.8,25,0,,,,0,,0,2.8,.28,1.27,1.12,,,,,,,0,0,,,,0,,,,,0,0,,0,0,0,0,0,,,,,
1,2,22,1,,8,2015,,1,,,,6,,4,3,48,"SOUP, BEANS, BLACK (50% BEANS)",,,,243,291,"EPAZOTE, COOKED, BLD",,A00XJ#F28.A07GL,"Epazote, PROCESS = Boiling",,1.1,0,0,,,,.1,,0,0,0,0,0,,,,,,,3,.02,,,,.0099999998,,,,,0,0,,0,2,0,.029999999,0,,,,,
1,2,22,1,,8,2015,,1,,,,6,,4,3,48,"SOUP, BEANS, BLACK (50% BEANS)",,,,243,290,"ONIONS, COOKED, BLD/GRILLED, WO/SALT, NOT DRAINED",,A00HC#F28.A07GL$F28.A07GZ$F10.A0CQE$F26.A07XE,"Onions, PROCESS = Boiling, PROCESS = Broiling/grilling, QUALITATIVE-INFO = Without added salt, GENERIC-TERM = Other",,5.3000002,2,.1,,,,.5,,.1,0,0,0,0,,,,,,,1,.0099999998,,,,.0099999998,,,,,0,0,,.0099999998,1,0,.31,0,,,,,
1,2,22,1,,8,2015,,1,,,,6,,1,3,254,"BEVERAGE, ATOLE, OATMEAL, BLD, W/WATER",,,,510,260,"SUGAR WHITE, GRANULATED FORTIFIED W/VIT A",,A032J#F09.A0EXZ$F03.A06JC,"White sugar, FORTIFICATION-AGENT = Vitamin A     (retinol, carotenoids), PHYSICAL-STATE = Fragments / granules / splinters",,54.200001,210,0,,,,54.200001,,0,0,0,0,0,,,,,,,1,.029999999,,,,.0099999998,,,,,0,.0099999998,,0,0,0,0,812,,,,,
1,2,22,1,,8,2015,,1,,,,6,,1,3,254,"BEVERAGE, ATOLE, OATMEAL, BLD, W/WATER",,,,510,306,"OATS INSTANT, FORTIFIED, PREPARED W/WATER",,A0ESM#F04.A00DJ$F10.A0F6C,"Porridge water based (ready to eat), INGREDIENT = Rolled oats, instant, QUALITATIVE-INFO = Fortified",,57.200001,39,1.4,,,,6.6999998,,1,.80000001,.13,.22,.25,,,,,,,46,3.4100001,,,,.34999999,,,,,.15000001,.13,,.17,3,0,0,74,,,,,
1,2,22,1,,8,2015,,1,,,,,,1,1,,,,,,,186,"PEACHES, COMMON, MATURE W/SKIN, RAW",,A01GM#F28.A07HS$F10.A07XL$F20.A07QE,"Common peaches, PROCESS = Raw, no heat treatment, QUALITATIVE-INFO = Ripe / mature, PART-CONSUMED-ANALYSED = With peel",,260,101,2.4000001,,,,24.799999,,3.9000001,.60000002,.050000001,.18000001,.23,,,,,,,16,.64999998,,,,.44,,,,,.050000001,.079999998,,.079999998,10,0,17.16,42,,,,,
1,2,22,1,,8,2015,,1,,,,,,2,1,,,,,,,211,"RED MOMBIN/SPANISH PLUM, RAW",,A0DRM#F28.A07HS,"Purple mombins, PROCESS = Raw, no heat treatment",,210,69,.60000002,,,,17.9,,1.9,.40000001,.20999999,.20999999,.20999999,,,,,,,10,.20999999,,,,0,,,,,.059999999,.059999999,,.15000001,15,0,37.799999,420,,,,,
1,2,22,2,,8,2015,,1,,,,2,,2,1,,,,,,,285,"WHEAT BREAD, SWEET (GUATEMALA)",,A004X#F10.A0CQM,"Wheat bread and rolls, QUALITATIVE-INFO = Sweet / mild",,63,231,5.9000001,,,,35.5,,1.4,7.3000002,1.37,2.21,.95999998,,,,,,,54,1.8099999,,,,.52999997,,,,,.23999999,.14,,.039999999,98,.07,.75999999,3,,,,,
1,2,22,2,,8,2015,,1,,,,2,,1,3,251,"BEVERAGE, ATOLE, INCAPARINA, BLD, W/WATER",,,,448,305,"NUTRITIVE BEVERAGE, INCAPARINA, POWDER, COOKED, BLD",,A0BZF#F28.A07GL$F26.A07XE,"Cereals with an added high protein food reconstituted, PROCESS = Boiling, GENERIC-TERM = Other",,21.5,46,2.5999999,,,,7.3000002,,1.2,.1,.02,.029999999,.059999999,,,,,,,72,2.6600001,,,,2.78,,,,,.19,.07,,.079999998,26,.18000001,0,192,,,,,
1,2,22,2,,8,2015,,1,,,,2,,1,3,251,"BEVERAGE, ATOLE, INCAPARINA, BLD, W/WATER",,,,448,260,"SUGAR WHITE, GRANULATED FORTIFIED W/VIT A",,A032J#F09.A0EXZ$F03.A06JC,"White sugar, FORTIFICATION-AGENT = Vitamin A     (retinol, carotenoids), PHYSICAL-STATE = Fragments / granules / splinters",,32.299999,125,0,,,,32.299999,,0,0,0,0,0,,,,,,,0,.02,,,,0,,,,,0,.0099999998,,0,0,0,0,485,,,,,
1,2,22,2,,8,2015,,1,,,,4,,3,3,10,"MAIZE, FLOUR, LIME-TREATED, COOKED, BLD",,,,217,335,"MAIZE, LIME TREATED, TOASTED",,A000T#F28.A07HC$F26.A07XE,"Maize grain, PROCESS = Toasting / coffee roasting, GENERIC-TERM = Other",,106.5,462,11.9,,,,97,,10.8,5.1999998,.62,1.24,2.23,,,,,,,364,2.97,,,,1.85,,,,,.18000001,.15000001,,.46000001,26,0,0,47,,,,,
1,2,22,2,,8,2015,,1,,,,4,,1,3,47,"BEANS, BLACK, PUREE (NOT FRIED)",,,,122,289,"BEANS, BLACK, MATURE SEEDS, COOKED, BLD, WO/SALT",,A012B#F28.A07GL$F10.A0CQE$F10.A07XL$F10.A166Z,"Borlotti or other common beans (without pods), PROCESS = Boiling, QUALITATIVE-INFO = Without added salt, QUALITATIVE-INFO = Ripe / mature, QUALITATIVE-INFO = Black",,65.5,87,5.8000002,,,,15.5,,5.6999998,.40000001,.090000004,.029999999,.15000001,,,,,,,18,1.38,,,,.73000002,,,,,.16,.039999999,,.050000001,98,0,0,0,,,,,
1,2,22,2,,8,2015,,1,,,,4,,1,3,47,"BEANS, BLACK, PUREE (NOT FRIED)",,,,122,291,"EPAZOTE, COOKED, BLD",,A00XJ#F28.A07GL,"Epazote, PROCESS = Boiling",,.60000002,0,0,,,,0,,0,0,0,0,0,,,,,,,2,.0099999998,,,,.0099999998,,,,,0,0,,0,1,0,.02,0,,,,,
1,2,22,2,,8,2015,,1,,,,4,,1,3,47,"BEANS, BLACK, PUREE (NOT FRIED)",,,,122,219,"SALT, TABLE",,A042R,"Salt, iodised",,.89999998,0,0,,,,0,,0,0,0,0,0,,,,,,,0,0,,,,0,,,,,0,0,,0,0,0,0,0,,,,,
1,2,22,2,,8,2015,,1,,,,4,,1,3,47,"BEANS, BLACK, PUREE (NOT FRIED)",,,,122,292,"OIL, SUNFLOWER, LINOLEIC",,A037D#F26.A07XE,"Sunflower seed oil, edible, GENERIC-TERM = Other",,1.5,13,0,,,,0,,0,1.5,.15000001,.67000002,.58999997,,,,,,,0,0,,,,0,,,,,0,0,,0,0,0,0,0,,,,,
1,2,22,2,,8,2015,,1,,,,4,,1,3,47,"BEANS, BLACK, PUREE (NOT FRIED)",,,,122,290,"ONIONS, COOKED, BLD/GRILLED, WO/SALT, NOT DRAINED",,A00HC#F28.A07GL$F28.A07GZ$F10.A0CQE$F26.A07XE,"Onions, PROCESS = Boiling, PROCESS = Broiling/grilling, QUALITATIVE-INFO = Without added salt, GENERIC-TERM = Other",,2.8,1,0,,,,.30000001,,0,0,0,0,0,,,,,,,1,.0099999998,,,,0,,,,,0,0,,0,0,0,.16,0,,,,,
1,2,22,2,,8,2015,,1,,,,4,,2,3,269,"BEVERAGE, REFRESHMENT, RICE BASED FLOUR (HORCHATA), W/WATER",,,,504,212,"RICE FLOUR, WHITE, UNENRICHED, BOILED",,A003F#F28.A07GL$F10.A0F6D$F10.A0F2R,"Rice flour, PROCESS = Boiling, QUALITATIVE-INFO = Not fortified, QUALITATIVE-INFO = White",,25.5,103,1.7,,,,22.5,,.69999999,.40000001,.11,.12,.11,,,,,,,3,.1,,,,.22,,,,,.029999999,.0099999998,,.11,1,0,0,0,,,,,
1,2,22,2,,8,2015,,1,,,,4,,2,3,269,"BEVERAGE, REFRESHMENT, RICE BASED FLOUR (HORCHATA), W/WATER",,,,504,301,"CINNAMON, GROUND",,A019V#F28.A07LA,"Cinnamon bark, PROCESS = Grinding / milling / crushing",,1.1,3,0,,,,.89999998,,.60000002,0,0,0,0,,,,,,,11,.090000004,,,,.02,,,,,0,0,,0,0,0,.039999999,0,,,,,
1,2,22,2,,8,2015,,1,,,,4,,2,3,269,"BEVERAGE, REFRESHMENT, RICE BASED FLOUR (HORCHATA), W/WATER",,,,504,260,"SUGAR WHITE, GRANULATED FORTIFIED W/VIT A",,A032J#F09.A0EXZ$F03.A06JC,"White sugar, FORTIFICATION-AGENT = Vitamin A     (retinol, carotenoids), PHYSICAL-STATE = Fragments / granules / splinters",,24.1,93,0,,,,24.1,,0,0,0,0,0,,,,,,,0,.0099999998,,,,0,,,,,0,0,,0,0,0,0,362,,,,,
1,2,22,2,,8,2015,,1,,,,6,,1,1,,,,,,,2,"AMARANTH/NIGHTSHADE (HIERBAMORA/MACUY/QUILETE) LEAVES, COOKED, BLD, WO/SALT, DRAINED",,A00ML#F28.A07GL$F10.A0CQE,"Amaranth leaves, PROCESS = Boiling, QUALITATIVE-INFO = Without added salt",,257,54,5.4000001,,,,10.6,,6,.5,.13,.1,.20999999,,,,,,,537,5.8099999,,,,2.26,,,,,.050000001,.33000001,,.46000001,146,0,105.63,357,,,,,
1,2,22,2,,8,2015,,1,,,,6,,3,3,10,"MAIZE, FLOUR, LIME-TREATED, COOKED, BLD",,,,155,335,"MAIZE, LIME TREATED, TOASTED",,A000T#F28.A07HC$F26.A07XE,"Maize grain, PROCESS = Toasting / coffee roasting, GENERIC-TERM = Other",,76.099998,330,8.5,,,,69.300003,,7.6999998,3.7,.44,.88,1.59,,,,,,,260,2.1199999,,,,1.3200001,,,,,.13,.11,,.33000001,19,0,0,34,,,,,
1,2,22,2,,8,2015,,1,,,,6,,2,3,254,"BEVERAGE, ATOLE, OATMEAL, BLD, W/WATER",,,,510,306,"OATS INSTANT, FORTIFIED, PREPARED W/WATER",,A0ESM#F04.A00DJ$F10.A0F6C,"Porridge water based (ready to eat), INGREDIENT = Rolled oats, instant, QUALITATIVE-INFO = Fortified",,57.200001,39,1.4,,,,6.6999998,,1,.80000001,.13,.22,.25,,,,,,,46,3.4100001,,,,.34999999,,,,,.15000001,.13,,.17,3,0,0,74,,,,,
1,2,22,2,,8,2015,,1,,,,6,,2,3,254,"BEVERAGE, ATOLE, OATMEAL, BLD, W/WATER",,,,510,260,"SUGAR WHITE, GRANULATED FORTIFIED W/VIT A",,A032J#F09.A0EXZ$F03.A06JC,"White sugar, FORTIFICATION-AGENT = Vitamin A     (retinol, carotenoids), PHYSICAL-STATE = Fragments / granules / splinters",,54.200001,210,0,,,,54.200001,,0,0,0,0,0,,,,,,,1,.029999999,,,,.0099999998,,,,,0,.0099999998,,0,0,0,0,812,,,,,
1,2,22,2,,8,2015,,1,,,,,,1,1,,,,,,,5,"APPLES, W/SKIN, RAW",,A01DJ#F28.A07HS$F20.A07QE,"Apples, PROCESS = Raw, no heat treatment, PART-CONSUMED-ANALYSED = With peel",,282,147,.69999999,,,,38.900002,,6.8000002,.5,.079999998,.029999999,.14,,,,,,,17,.34,,,,.11,,,,,.059999999,.079999998,,.11,8,0,12.97,8,,,,,
1,2,22,2,,8,2015,,1,,,,,,2,1,,,,,,,211,"RED MOMBIN/SPANISH PLUM, RAW",,A0DRM#F28.A07HS,"Purple mombins, PROCESS = Raw, no heat treatment",,155,51,.5,,,,13.2,,1.4,.30000001,.16,.16,.16,,,,,,,8,.16,,,,0,,,,,.050000001,.050000001,,.11,11,0,27.9,310,,,,,
2,2,23,1,,1,2015,,1,,,,2,,2,1,,,,,,,130,"EGGS, WHOLE, COOKED, PAN FRIED",,A032C#F28.A07GS,"Fried eggs, PROCESS = Pan frying / shallow frying",,66,129,9,,,,.5,,0,9.8000002,2.8499999,4.0799999,2.1500001,,,,,,,41,1.25,,,,.92000002,,,,,.029999999,.33000001,,.12,34,.63999999,0,145,,,,,
2,2,23,1,,1,2015,,1,,,,2,,3,3,10,"MAIZE, FLOUR, LIME-TREATED, COOKED, BLD",,,,80,335,"MAIZE, LIME TREATED, TOASTED",,A000T#F28.A07HC$F26.A07XE,"Maize grain, PROCESS = Toasting / coffee roasting, GENERIC-TERM = Other",,39.299999,170,4.4000001,,,,35.700001,,4,1.9,.23,.46000001,.81999999,,,,,,,134,1.1,,,,.68000001,,,,,.07,.050000001,,.17,10,0,0,17,,,,,
2,2,23,1,,1,2015,,1,,,,2,,5,3,48,"SOUP, BEANS, BLACK (50% BEANS)",,,,244,289,"BEANS, BLACK, MATURE SEEDS, COOKED, BLD, WO/SALT",,A012B#F28.A07GL$F10.A0CQE$F10.A07XL$F10.A166Z,"Borlotti or other common beans (without pods), PROCESS = Boiling, QUALITATIVE-INFO = Without added salt, QUALITATIVE-INFO = Ripe / mature, QUALITATIVE-INFO = Black",,123.9,164,11,,,,29.4,,10.8,.69999999,.17,.059999999,.28,,,,,,,33,2.5999999,,,,1.39,,,,,.30000001,.07,,.090000004,185,0,0,0,,,,,
2,2,23,1,,1,2015,,1,,,,2,,5,3,48,"SOUP, BEANS, BLACK (50% BEANS)",,,,244,219,"SALT, TABLE",,A042R,"Salt, iodised",,1.6,0,0,,,,0,,0,0,0,0,0,,,,,,,0,.0099999998,,,,0,,,,,0,0,,0,0,0,0,0,,,,,
2,2,23,1,,1,2015,,1,,,,2,,5,3,48,"SOUP, BEANS, BLACK (50% BEANS)",,,,244,290,"ONIONS, COOKED, BLD/GRILLED, WO/SALT, NOT DRAINED",,A00HC#F28.A07GL$F28.A07GZ$F10.A0CQE$F26.A07XE,"Onions, PROCESS = Boiling, PROCESS = Broiling/grilling, QUALITATIVE-INFO = Without added salt, GENERIC-TERM = Other",,5.4000001,2,.1,,,,.5,,.1,0,0,0,0,,,,,,,1,.0099999998,,,,.0099999998,,,,,0,0,,.0099999998,1,0,.31,0,,,,,
2,2,23,1,,1,2015,,1,,,,2,,5,3,48,"SOUP, BEANS, BLACK (50% BEANS)",,,,244,292,"OIL, SUNFLOWER, LINOLEIC",,A037D#F26.A07XE,"Sunflower seed oil, edible, GENERIC-TERM = Other",,2.8,25,0,,,,0,,0,2.8,.28,1.27,1.13,,,,,,,0,0,,,,0,,,,,0,0,,0,0,0,0,0,,,,,
2,2,23,1,,1,2015,,1,,,,2,,5,3,48,"SOUP, BEANS, BLACK (50% BEANS)",,,,244,291,"EPAZOTE, COOKED, BLD",,A00XJ#F28.A07GL,"Epazote, PROCESS = Boiling",,1.1,0,0,,,,.1,,0,0,0,0,0,,,,,,,3,.02,,,,.0099999998,,,,,0,0,,0,2,0,.029999999,0,,,,,
2,2,23,1,,1,2015,,1,,,,2,,4,3,155,"SAUCE, CHIRMOL W/RED TOMATO, HOMEMADE, COOKED",,,,76,346,"TOMATO RED, RIPE, COOKED, GRILLED",,A0DMX#F28.A07GZ$F10.A0F2S$F10.A07XL,"Tomatoes, PROCESS = Broiling/grilling, QUALITATIVE-INFO = Red, QUALITATIVE-INFO = Ripe / mature",,74.800003,17,.80000001,,,,3.7,,1.2,.2,.029999999,.029999999,.079999998,,,,,,,10,.25999999,,,,.16,,,,,.039999999,.0099999998,,.07,10,0,12.48,36,,,,,
2,2,23,1,,1,2015,,1,,,,2,,4,3,155,"SAUCE, CHIRMOL W/RED TOMATO, HOMEMADE, COOKED",,,,76,219,"SALT, TABLE",,A042R,"Salt, iodised",,.5,0,0,,,,0,,0,0,0,0,0,,,,,,,0,0,,,,0,,,,,0,0,,0,0,0,0,0,,,,,
2,2,23,1,,1,2015,,1,,,,2,,4,3,155,"SAUCE, CHIRMOL W/RED TOMATO, HOMEMADE, COOKED",,,,76,175,"ONIONS, COOKED, BLD/GRILLED, WO/SALT,DRAINED",,A00HC#F28.A07GL$F28.A07GZ$F10.A0CQE,"Onions, PROCESS = Boiling, PROCESS = Broiling/grilling, QUALITATIVE-INFO = Without added salt",,.80000001,0,0,,,,.1,,0,0,0,0,0,,,,,,,0,0,,,,0,,,,,0,0,,0,0,0,.039999999,0,,,,,
2,2,23,1,,1,2015,,1,,,,2,,1,3,263,"BEVERAGE, COFFEE, BREWED FROM GROUNDS, W/SUGAR AND WATER",,,,255,312,"COFFEE, BREWED PREPARED W/WATER",,A03KA#F04.A03GN$F04.A03DK,"Coffee beverages, INGREDIENT = Coffee ground, roasted, INGREDIENT = Drinking water",,233.39999,2,.30000001,,,,0,,0,0,0,.050000001,0,,,,,,,5,.02,,,,.050000001,,,,,.02,.19,,0,5,0,0,0,,,,,
2,2,23,1,,1,2015,,1,,,,2,,1,3,263,"BEVERAGE, COFFEE, BREWED FROM GROUNDS, W/SUGAR AND WATER",,,,255,260,"SUGAR WHITE, GRANULATED FORTIFIED W/VIT A",,A032J#F09.A0EXZ$F03.A06JC,"White sugar, FORTIFICATION-AGENT = Vitamin A     (retinol, carotenoids), PHYSICAL-STATE = Fragments / granules / splinters",,21.6,84,0,,,,21.6,,0,0,0,0,0,,,,,,,0,.0099999998,,,,0,,,,,0,0,,0,0,0,0,324,,,,,
2,2,23,1,,1,2015,,1,,,,4,,2,1,,,,,,,89,"CHEESE, QUESO FRESCO, CUAJADA TYPE",,A0CRN,Cheese curd,,14,42,2.5,,,,.40000001,,0,3.3,1.8099999,.83999997,.16,,,,,,,79,.029999999,,,,.36000001,,,,,.0099999998,.02,,.0099999998,1,.23999999,0,31,,,,,
2,2,23,1,,1,2015,,1,,,,4,,3,3,10,"MAIZE, FLOUR, LIME-TREATED, COOKED, BLD",,,,240,335,"MAIZE, LIME TREATED, TOASTED",,A000T#F28.A07HC$F26.A07XE,"Maize grain, PROCESS = Toasting / coffee roasting, GENERIC-TERM = Other",,117.8,511,13.1,,,,107.2,,11.9,5.6999998,.68000001,1.37,2.46,,,,,,,403,3.29,,,,2.05,,,,,.2,.16,,.50999999,29,0,0,52,,,,,
2,2,23,1,,1,2015,,1,,,,4,,1,3,266,"BEVERAGE, LIMEADE, HOMEMADE",,,,384,157,"LIME JUICE, RAW",,A03AJ#F28.A07HS,"Juice, lime, PROCESS = Raw, no heat treatment",,10.1,3,0,,,,.80000001,,0,0,0,0,0,,,,,,,1,.0099999998,,,,.0099999998,,,,,0,0,,0,1,0,3.02,0,,,,,
2,2,23,1,,1,2015,,1,,,,4,,1,3,266,"BEVERAGE, LIMEADE, HOMEMADE",,,,384,260,"SUGAR WHITE, GRANULATED FORTIFIED W/VIT A",,A032J#F09.A0EXZ$F03.A06JC,"White sugar, FORTIFICATION-AGENT = Vitamin A     (retinol, carotenoids), PHYSICAL-STATE = Fragments / granules / splinters",,33.299999,129,0,,,,33.299999,,0,0,0,0,0,,,,,,,0,.02,,,,0,,,,,0,.0099999998,,0,0,0,0,499,,,,,
2,2,23,1,,1,2015,,1,,,,6,,2,1,,,,,,,101,"CHIPILIN LEAVES, COOKED,BLD, WO/SALT, DRAINED",,A00KR#F28.A07GL$F10.A0CQE$F26.A07XE,"Leafy vegetables, PROCESS = Boiling, QUALITATIVE-INFO = Without added salt, GENERIC-TERM = Other",,360,83,10.7,,,,13.5,,8.6000004,.89999998,.14,.039999999,.40000001,,,,,,,490,12.85,,,,2.74,,,,,.36000001,.86000001,,.86000001,526,0,35.279999,1886,,,,,
2,2,23,1,,1,2015,,1,,,,6,,3,3,10,"MAIZE, FLOUR, LIME-TREATED, COOKED, BLD",,,,240,335,"MAIZE, LIME TREATED, TOASTED",,A000T#F28.A07HC$F26.A07XE,"Maize grain, PROCESS = Toasting / coffee roasting, GENERIC-TERM = Other",,117.8,511,13.1,,,,107.2,,11.9,5.6999998,.68000001,1.37,2.46,,,,,,,403,3.29,,,,2.05,,,,,.2,.16,,.50999999,29,0,0,52,,,,,
2,2,23,1,,1,2015,,1,,,,6,,1,3,62,"BEVERAGE,  WHOLE MILK, W/ADDED SUGAR",,,,360,169,"MILK, FLUID, WHOLE (3.25% MILKFAT), W/O ADDED VIT A AND D",,A02LY#F07.A06ZT,"Cow milk, whole, FAT-CONTENT = 3.2 % fat",,242.8,148,7.5999999,,,,11.6,,0,7.9000001,4.54,1.97,.49000001,,,,,,,274,.07,,,,.89999998,,,,,.12,.41,,.1,12,1.09,0,112,,,,,
2,2,23,1,,1,2015,,1,,,,6,,1,3,62,"BEVERAGE,  WHOLE MILK, W/ADDED SUGAR",,,,360,260,"SUGAR WHITE, GRANULATED FORTIFIED W/VIT A",,A032J#F09.A0EXZ$F03.A06JC,"White sugar, FORTIFICATION-AGENT = Vitamin A     (retinol, carotenoids), PHYSICAL-STATE = Fragments / granules / splinters",,11.2,43,0,,,,11.2,,0,0,0,0,0,,,,,,,0,.0099999998,,,,0,,,,,0,0,,0,0,0,0,167,,,,,
2,2,23,1,,1,2015,,1,,,,,,6,1,,,,,,,285,"WHEAT BREAD, SWEET (GUATEMALA)",,A004X#F10.A0CQM,"Wheat bread and rolls, QUALITATIVE-INFO = Sweet / mild",,64,235,6,,,,36.099998,,1.5,7.4000001,1.4,2.24,.98000002,,,,,,,55,1.84,,,,.54000002,,,,,.23999999,.15000001,,.039999999,99,.07,.76999998,3,,,,,
2,2,23,1,,1,2015,,1,,,,,,3,1,,,,,,,75,"CARBONATED BEVERAGE, COLA TYPE W/CAFFEINE",,A03FR,"Cola beverages, caffeinic",,252,106,0,,,,26.1,,0,.60000002,0,0,0,,,,,,,3,.050000001,,,,.23,,,,,0,0,,0,0,0,0,0,,,,,
2,2,23,1,,1,2015,,1,,,,,,4,1,,,,,,,157,"LIME JUICE, RAW",,A03AJ#F28.A07HS,"Juice, lime, PROCESS = Raw, no heat treatment",,28,7,.1,,,,2.4000001,,.1,0,0,0,.0099999998,,,,,,,4,.029999999,,,,.02,,,,,.0099999998,.0099999998,,.0099999998,3,0,8.3999996,1,,,,,
2,2,23,1,,1,2015,,1,,,,,,5,3,10,"MAIZE, FLOUR, LIME-TREATED, COOKED, BLD",,,,200,335,"MAIZE, LIME TREATED, TOASTED",,A000T#F28.A07HC$F26.A07XE,"Maize grain, PROCESS = Toasting / coffee roasting, GENERIC-TERM = Other",,98.199997,426,11,,,,89.400002,,9.8999996,4.8000002,.56999999,1.14,2.05,,,,,,,336,2.74,,,,1.71,,,,,.17,.14,,.41999999,24,0,0,43,,,,,