id,hh_id,country,sec_area,tert_area,round,smpl_weight,sex,age,edc_level,edc,residence,preg_lact,breastfeeding,hh_head,wgt,wgt_method,hgt,hgt_method,bmi_adults,bmi_children,bmi_cat,misrep,pa,pa_cat,smok,special_diet,special_diet_other,clin_diet,clin_diet_other,note,bmi_age_z,bmi_chld,hh_head_member,nvals
101C,,Ethiopia,2,Alaba,1,,1,3,1,0,1,,0,,12.95,1,85.2,1,,,,,,,,,,,,,1.59,17.839825,,1
101M,,Ethiopia,2,Alaba,1,,2,40,1,0,1,0,,,55.3,1,160.05,1,21.588068,,2,,,,,,,,,,,,1,1
102C,,Ethiopia,2,Alaba,1,,2,2,1,0,1,,0,,8.6,1,72.09999999999999,1,,,,,,,,,,,,,.5600000000000001,16.54352,,1
102M,,Ethiopia,2,Alaba,1,,2,35,1,0,1,1,,,53.45,1,156.1,1,21.935215,,2,,,,,,,,,,,,1,1
103C,,Ethiopia,2,Alaba,1,,1,.58,1,0,1,,3,,8.1,1,67.09999999999999,1,,,,,,,,,,,,,.45,17.990366,,1
103M,,Ethiopia,2,Alaba,1,,2,25,1,0,1,2,,,50.15,1,166.65,1,18.057611,,1,,,,,,,,,,,,1,1
105C,,Ethiopia,2,Alaba,1,,2,1.17,1,0,1,,3,,7.7,1,72.25,1,,,,,,,,,,,,,-1,14.750781,,1
105M,,Ethiopia,2,Alaba,1,,2,24,1,0,1,2,,,63.65,1,157,1,25.822548,,3,,,,,,,,,,,,1,1
108C,,Ethiopia,2,Alaba,1,,1,3,1,0,1,,0,,11.4,1,84.5,1,,,,,,,,,,,,,.4,15.965828,,1
108M,,Ethiopia,2,Alaba,1,,2,26,1,0,1,1,,,50,1,151.7,1,21.726954,,2,,,,,,,,,,,,1,1
113C,,Ethiopia,2,Alaba,1,,2,1.67,1,0,1,,3,,11.3,1,80,1,,,,,,,,,,,,,1.4,17.65625,,1
113M,,Ethiopia,2,Alaba,1,,2,20,1,0,1,2,,,53.2,1,162.1,1,20.246298,,2,,,,,,,,,,,,1,1
114C,,Ethiopia,2,Alaba,1,,1,1.08,1,0,1,,3,,7.7,1,72.09999999999999,1,,,,,,,,,,,,,-1.56,14.812222,,1
114M,,Ethiopia,2,Alaba,1,,2,20,1,0,1,2,,,51.5,1,164.1,1,19.124498,,2,,,,,,,,,,,,1,1
117C,,Ethiopia,2,Alaba,1,,2,.92,1,0,1,,3,,8,1,74.2,1,,,,,,,,,,,,,-1.46,14.530554,,1
117M,,Ethiopia,2,Alaba,1,,2,26,1,0,1,2,,,50.2,1,159.1,1,19.831856,,2,,,,,,,,,,,,1,1
119C,,Ethiopia,2,Alaba,1,,2,1.42,1,0,1,,3,,9.699999999999999,1,80.3,1,,,,,,,,,,,,,-.55,15.043215,,1
119M,,Ethiopia,2,Alaba,1,,2,27,1,0,1,2,,,61.5,1,165.1,1,22.562176,,2,,,,,,,,,,,,1,1
120C,,Ethiopia,2,Alaba,1,,2,.67,1,0,1,,3,,6.6,1,65.59999999999999,1,,,,,,,,,,,,,-1.04,15.336853,,1
120M,,Ethiopia,2,Alaba,1,,2,25,1,0,1,2,,,47.3,1,160.2,1,18.430458,,1,,,,,,,,,,,,1,1
136C,,Ethiopia,2,Alaba,1,,1,1.33,1,0,1,,3,,10,1,76.90000000000001,1,,,,,,,,,,,,,.44,16.910145,,1
136M,,Ethiopia,2,Alaba,1,,2,20,1,0,1,2,,,51.8,1,159.7,1,20.310469,,2,,,,,,,,,,,,1,1
139C,,Ethiopia,2,Alaba,1,,2,2,1,0,1,,,,11.55,1,85.45,1,,,,,,,,,,,,,.31,15.818229,,1
139M,,Ethiopia,2,Alaba,1,,2,25,1,0,1,1,,,56.15,1,155.45,1,23.236372,,2,,,,,,,,,,,,1,1
13C,,Ethiopia,2,Alaba,1,,2,3,1,0,1,,0,,12.8,1,90.3,1,,,,,,,,,,,,,.23,15.697644,,1
13M,,Ethiopia,2,Alaba,1,,2,22,1,0,1,1,,,62.35,1,154.3,1,26.188137,,3,,,,,,,,,,,,1,1
140C,,Ethiopia,2,Alaba,1,,1,1.42,1,0,1,,3,,8.35,1,75.09999999999999,1,,,,,,,,,,,,,-1.17,14.804938,,1
140M,,Ethiopia,2,Alaba,1,,2,30,1,0,1,2,,,56.15,1,162.1,1,21.368977,,2,,,,,,,,,,,,1,1
142C,,Ethiopia,2,Alaba,1,,2,1.17,1,1,1,,,,8.5,1,73,1,,,,,,,,,,,,,-.08,15.950459,,1
142M,,Ethiopia,2,Alaba,1,,2,25,1,1,1,2,,,49.85,1,150.45,1,22.023218,,2,,,,,,,,,,,,1,1
146C,,Ethiopia,2,Alaba,1,,1,1.17,1,0,1,,3,,8.949999999999999,1,74.84999999999999,1,,,,,,,,,,,,,-.49,15.974947,,1
146M,,Ethiopia,2,Alaba,1,,2,27,1,0,1,2,,,63.55,1,163.85,1,23.671329,,2,,,,,,,,,,,,1,1
147C,,Ethiopia,2,Alaba,1,,1,.92,1,0,1,,3,,7.35,1,69.40000000000001,1,,,,,,,,,,,,,-1.3,15.260488,,1
147M,,Ethiopia,2,Alaba,1,,2,23,1,0,1,2,,,66.59999999999999,1,173.15,1,22.214127,,2,,,,,,,,,,,,1,1
14C,,Ethiopia,2,Alaba,1,,2,2,1,6,1,,0,,10.5,1,82.2,1,,,,,,,,,,,,,-.03,15.539808,,1
14M,,Ethiopia,2,Alaba,1,,2,25,1,6,1,0,,,55.5,1,157.9,1,22.260183,,2,,,,,,,,,,,,1,1
155C,,Ethiopia,2,Alaba,1,,1,.58,1,0,1,,3,,6.85,1,62.6,1,,,,,,,,,,,,,.1,17.480019,,1
155M,,Ethiopia,2,Alaba,1,,2,35,1,0,1,2,,,49.05,1,145.2,1,23.265146,,2,,,,,,,,,,,,1,1
161C,,Ethiopia,2,Alaba,1,,1,.83,1,4,1,,0,,9.65,1,82.05,1,,,,,,,,,,,,,-2.2,14.33409,,1
161M,,Ethiopia,2,Alaba,1,,2,18,1,4,1,2,,,58.65,1,160.45,1,,,,,,,,,,,,,,22.781828,1,1
162C,,Ethiopia,2,Alaba,1,,1,.75,2,8,1,,3,,8.050000000000001,1,68.34999999999999,1,,,,,,,,,,,,,.02,17.231331,,1
162M,,Ethiopia,2,Alaba,1,,2,16,2,8,1,2,,,56.45,1,158.5,1,,,,,,,,,,,,,,22.470121,1,1
163C,,Ethiopia,2,Alaba,1,,2,.67,1,3,1,,3,,6.8,1,65.40000000000001,1,,,,,,,,,,,,,-.63,15.8984,,1
163M,,Ethiopia,2,Alaba,1,,2,16,1,3,1,2,,,54,1,157.2,1,,,,,,,,,,,,,,21.851873,1,1
164C,,Ethiopia,2,Alaba,1,,2,.92,1,0,1,,3,,6.8,1,67.8,1,,,,,,,,,,,,,-1.23,14.79277,,1
164M,,Ethiopia,2,Alaba,1,,2,28,1,0,1,2,,,58.2,1,162.1,1,22.149145,,2,,,,,,,,,,,,1,1
167C,,Ethiopia,2,Alaba,1,,1,1.92,1,3,1,,0,,10.2,1,79.75,1,,,,,,,,,,,,,.19,16.037579,,1
167M,,Ethiopia,2,Alaba,1,,2,20,1,3,1,1,,,56.35,1,161.2,1,21.685221,,2,,,,,,,,,,,,1,1
168C,,Ethiopia,2,Alaba,1,,2,1.25,1,0,1,,3,,8,1,69.3,1,,,,,,,,,,,,,.45,16.658026,,1
168M,,Ethiopia,2,Alaba,1,,2,30,1,0,1,2,,,45.35,1,156.6,1,18.492422,,1,,,,,,,,,,,,1,1
169C,,Ethiopia,2,Alaba,1,,1,1.08,1,0,1,,3,,7.55,1,68.5,1,,,,,,,,,,,,,-.47,16.090363,,1
169M,,Ethiopia,2,Alaba,1,,2,26,1,0,1,2,,,46.4,1,156.3,1,18.993282,,2,,,,,,,,,,,,1,1
16C,,Ethiopia,2,Alaba,1,,1,1.08,1,0,1,,3,,7.95,1,72.90000000000001,1,,,,,,,,,,,,,-1.43,14.959328,,1
16M,,Ethiopia,2,Alaba,1,,2,28,1,0,1,2,,,54.05,1,148,1,24.675858,,2,,,,,,,,,,,,1,1
170C,,Ethiopia,2,Alaba,1,,1,.5,1,0,1,,3,,6.55,1,,,,,,,,,,,,,,,-3.35,,,1
170M,,Ethiopia,2,Alaba,1,,2,30,1,0,1,2,,,44.75,1,160.25,1,17.42597,,1,,,,,,,,,,,,1,1
172C,,Ethiopia,2,Alaba,1,,2,.5,1,6,1,,3,,6.45,1,67.34999999999999,1,,,,,,,,,,,,,-1.62,14.219506,,1
172M,,Ethiopia,2,Alaba,1,,2,18,1,6,1,2,,,52,1,154,1,,,,,,,,,,,,,,21.926126,1,1
175C,,Ethiopia,2,Alaba,1,,1,1.92,1,0,1,,,,11.55,1,79,1,,,,,,,,,,,,,1.95,18.506649,,1
175M,,Ethiopia,2,Alaba,1,,2,25,1,0,1,2,,,58.75,1,157.3,1,23.743811,,2,,,,,,,,,,,,1,1
176C,,Ethiopia,2,Alaba,1,,1,2,1,0,1,,,,11.35,1,84.8,1,,,,,,,,,,,,,-.08,15.78353,,1
176M,,Ethiopia,2,Alaba,1,,2,25,1,0,1,2,,,55.9,1,159.3,1,22.028263,,2,,,,,,,,,,,,1,1
18C,,Ethiopia,2,Alaba,1,,2,1.92,1,0,1,,3,,10.3,1,82,1,,,,,,,,,,,,,-.08,15.318263,,1
18M,,Ethiopia,2,Alaba,1,,2,25,1,0,1,3,,,53,1,162.5,1,20.071007,,2,,,,,,,,,,,,1,1
191C,,Ethiopia,2,Alaba,1,,1,.75,1,0,1,,3,,9,1,70.90000000000001,1,,,,,,,,,,,,,.53,17.903999,,1
191M,,Ethiopia,2,Alaba,1,,2,32,1,0,1,2,,,61.4,1,165.1,1,22.525488,,2,,,,,,,,,,,,1,1
198C,,Ethiopia,2,Alaba,1,,1,4,1,0,1,,3,,10.25,1,84.40000000000001,1,,,,,,,,,,,,,-.82,14.389277,,1
198M,,Ethiopia,2,Alaba,1,,2,28,1,0,1,2,,,39.7,1,148.5,1,18.002699,,1,,,,,,,,,,,,1,1
208C,,Ethiopia,2,Alaba,1,,2,3,1,2,1,,,,13.7,1,95.55,1,,,,,,,,,,,,,-.24,15.005801,,1
208M,,Ethiopia,2,Alaba,1,,2,34,1,2,1,0,,,58,1,159.9,1,22.684597,,2,,,,,,,,,,,,1,1
210C,,Ethiopia,2,Alaba,1,,2,.58,1,0,1,,3,,7.2,1,67.09999999999999,1,,,,,,,,,,,,,-.62,15.991436,,1
210M,,Ethiopia,2,Alaba,1,,2,29,1,0,1,2,,,58.1,1,162.3,1,22.056627,,2,,,,,,,,,,,,1,1
216C,,Ethiopia,2,Alaba,1,,2,.75,1,0,1,,3,,7.3,1,68.3,1,,,,,,,,,,,,,-.78,15.648815,,1
216M,,Ethiopia,2,Alaba,1,,2,30,1,0,1,2,,,52.05,1,165.4,1,19.026098,,2,,,,,,,,,,,,1,1
217C,,Ethiopia,2,Alaba,1,,1,1.08,1,0,1,,3,,7.75,1,71.09999999999999,1,,,,,,,,,,,,,-1.06,15.330718,,1
217M,,Ethiopia,2,Alaba,1,,2,22,1,0,1,2,,,42.1,1,157.7,1,16.928509,,1,,,,,,,,,,,,1,1
218C,,Ethiopia,2,Alaba,1,,1,1.08,1,0,1,,3,,7.35,1,68.2,1,,,,,,,,,,,,,-.71,15.802238,,1
218M,,Ethiopia,2,Alaba,1,,2,27,1,0,1,2,,,46.6,1,153.7,1,19.725962,,2,,,,,,,,,,,,1,1
219C,,Ethiopia,2,Alaba,1,,1,.58,1,0,1,,3,,5.9,1,64,1,,,,,,,,,,,,,-2.31,14.404297,,1
219M,,Ethiopia,2,Alaba,1,,2,30,1,0,1,2,,,45.05,1,157.2,1,18.230127,,1,,,,,,,,,,,,1,1
222C,,Ethiopia,2,Alaba,1,,2,3,1,0,1,,0,,12.25,1,85.59999999999999,1,,,,,,,,,,,,,.94,16.718163,,1
222M,,Ethiopia,2,Alaba,1,,2,38,1,0,1,0,,,50.6,1,157,1,20.528215,,2,,,,,,,,,,,,1,1
223C,,Ethiopia,2,Alaba,1,,2,3,1,0,1,,,,10.5,1,80,1,,,,,,,,,,,,,.64,16.40625,,1
223M,,Ethiopia,2,Alaba,1,,2,32,1,0,1,1,,,60.1,1,160.8,1,23.243546,,2,,,,,,,,,,,,1,1
225C,,Ethiopia,2,Alaba,1,,2,3,1,0,1,,0,,12.15,1,88.45,1,,,,,,,,,,,,,.14,15.530327,,1
225M,,Ethiopia,2,Alaba,1,,2,28,1,0,1,1,,,,,,,,,,,,,,,,,,,,,1,1
226C,,Ethiopia,2,Alaba,1,,1,1.92,1,0,1,,,,7.85,1,73.5,1,,,,,,,,,,,,,-1.08,14.530982,,1
226M,,Ethiopia,2,Alaba,1,,2,30,1,0,1,2,,,48.6,1,154.2,1,20.439371,,2,,,,,,,,,,,,1,1
229C,,Ethiopia,2,Alaba,1,,1,3,1,0,1,,,,10.85,1,85.8,1,,,,,,,,,,,,,-.77,14.738564,,1
229M,,Ethiopia,2,Alaba,1,,2,30,1,0,1,3,,,53.1,1,159.4,1,20.898634,,2,,,,,,,,,,,,1,1
230C,,Ethiopia,2,Alaba,1,,1,2,1,0,1,,,,10.2,1,80.3,1,,,,,,,,,,,,,-.13,15.818638,,1
230M,,Ethiopia,2,Alaba,1,,2,34,1,0,1,2,,,52.6,1,162.5,1,19.919527,,2,,,,,,,,,,,,1,1
232C,,Ethiopia,2,Alaba,1,,2,2,1,0,1,,,,11.95,1,86.2,1,,,,,,,,,,,,,.36,16.082493,,1
232M,,Ethiopia,2,Alaba,1,,2,38,1,0,1,2,,,54.5,1,159.7,1,21.369122,,2,,,,,,,,,,,,1,1
233C,,Ethiopia,2,Alaba,1,,2,5,1,0,1,,,,12.85,1,90.8,1,,,,,,,,,,,,,.22,15.585884,,1
233M,,Ethiopia,2,Alaba,1,,2,32,1,0,1,1,,,65.7,1,160.3,1,25.568092,,3,,,,,,,,,,,,1,1
234C,,Ethiopia,2,Alaba,1,,2,.75,1,0,1,,3,,6.95,1,65.7,1,,,,,,,,,,,,,-.42,16.101046,,1
234M,,Ethiopia,2,Alaba,1,,2,36,1,0,1,2,,,58.1,1,161.3,1,22.330959,,2,,,,,,,,,,,,1,1
239C,,Ethiopia,2,Alaba,1,,1,2,1,0,1,,,,10.25,1,83,1,,,,,,,,,,,,,-.9,14.878792,,1
239M,,Ethiopia,2,Alaba,1,,2,27,1,0,1,2,,,53.15,1,164.2,1,19.713192,,2,,,,,,,,,,,,1,1
23C,,Ethiopia,2,Alaba,1,,1,1.33,1,0,1,,3,,8,1,72,1,,,,,,,,,,,,,-.7,15.432098,,1
23M,,Ethiopia,2,Alaba,1,,2,35,1,0,1,2,,,50,1,164.53,1,18.470549,,1,,,,,,,,,,,,1,1
241C,,Ethiopia,2,Alaba,1,,1,1.92,1,0,1,,3,,9.25,1,77.40000000000001,1,,,,,,,,,,,,,-.31,15.440445,,1
241M,,Ethiopia,2,Alaba,1,,2,25,1,0,1,2,,,45.05,1,149.7,1,20.102552,,2,,,,,,,,,,,,1,1
243C,,Ethiopia,2,Alaba,1,,2,1,1,2,1,,3,,7.3,1,68.45,1,,,,,,,,,,,,,-.52,15.580305,,1
243M,,Ethiopia,2,Alaba,1,,2,25,1,2,1,2,,,52.15,1,156.2,1,21.374317,,2,,,,,,,,,,,,1,1
249C,,Ethiopia,2,Alaba,1,,1,1.83,1,0,1,,,,9.25,1,74.8,1,,,,,,,,,,,,,.53,16.532499,,1
249M,,Ethiopia,2,Alaba,1,,2,25,1,0,1,2,,,51.2,1,162,1,19.509222,,2,,,,,,,,,,,,1,1
251C,,Ethiopia,2,Alaba,1,,1,.92,1,2,1,,3,,6.05,1,66.45,1,,,,,,,,,,,,,-2.71,13.701414,,1
251M,,Ethiopia,2,Alaba,1,,2,20,1,2,1,2,,,50.8,1,164.9,1,18.681959,,2,,,,,,,,,,,,1,1
253C,,Ethiopia,2,Alaba,1,,1,1.92,1,0,1,,3,,7.6,1,74.7,1,,,,,,,,,,,,,-2.01,13.619852,,1
253M,,Ethiopia,2,Alaba,1,,2,28,1,0,1,2,,,37.75,1,143.15,1,18.421892,,1,,,,,,,,,,,,1,1
255C,,Ethiopia,2,Alaba,1,,2,3,1,0,1,,,,10.6,1,88,1,,,,,,,,,,,,,-1.45,13.688017,,1
255M,,Ethiopia,2,Alaba,1,,2,34,1,0,1,1,,,56.35,1,160.13,1,21.975994,,2,,,,,,,,,,,,1,1
258C,,Ethiopia,2,Alaba,1,,1,1.83,1,0,1,,,,10.95,1,83.2,1,,,,,,,,,,,,,-.01,15.818579,,1
258M,,Ethiopia,2,Alaba,1,,2,32,1,0,1,2,,,55.1,1,151.2,1,24.101719,,2,,,,,,,,,,,,1,1
259C,,Ethiopia,2,Alaba,1,,2,2,1,0,1,,,,9.1,1,78.5,1,,,,,,,,,,,,,-.51,14.767333,,1
259M,,Ethiopia,2,Alaba,1,,2,30,1,0,1,2,,,46.3,1,152.4,1,19.934763,,2,,,,,,,,,,,,1,1
25C,,Ethiopia,2,Alaba,1,,1,2,1,0,1,,3,,10,1,81.09999999999999,1,,,,,,,,,,,,,-.6800000000000001,15.204015,,1
25M,,Ethiopia,2,Alaba,1,,2,25,1,0,1,2,,,40,1,147.7,1,18.335764,,1,,,,,,,,,,,,1,1
263C,,Ethiopia,2,Alaba,1,,2,2,1,3,1,,,,10.05,1,78.3,1,,,,,,,,,,,,,.57,16.392401,,1
263M,,Ethiopia,2,Alaba,1,,2,28,1,3,1,2,,,50.85,1,153.2,1,21.665735,,2,,,,,,,,,,,,1,1
267C,,Ethiopia,2,Alaba,1,,2,3,1,0,1,,0,,9.5,1,83,1,,,,,,,,,,,,,-1.41,13.7901,,1
267M,,Ethiopia,2,Alaba,1,,2,35,1,0,1,1,,,48.5,1,155.3,1,20.109386,,2,,,,,,,,,,,,1,1
270C,,Ethiopia,2,Alaba,1,,1,2,1,0,1,,,,9.949999999999999,1,80,1,,,,,,,,,,,,,-.36,15.546875,,1
270M,,Ethiopia,2,Alaba,1,,2,28,1,0,1,2,,,49.35,1,160,1,19.277344,,2,,,,,,,,,,,,1,1
271C,,Ethiopia,2,Alaba,1,,1,1.25,1,6,2,,3,,6.95,1,67,1,,,,,,,,,,,,,-.39,15.48229,,1
271M,,Ethiopia,2,Alaba,1,,2,18,1,6,2,2,,,49.4,1,160.9,1,,,,,,,,,,,,,,19.081604,1,1
276C,,Ethiopia,2,Alaba,1,,1,2,1,0,1,,3,,8.65,1,73.8,1,,,,,,,,,,,,,-.02,15.881934,,1
276M,,Ethiopia,2,Alaba,1,,2,38,1,0,1,2,,,42.15,1,157.7,1,16.948614,,1,,,,,,,,,,,,1,1
277C,,Ethiopia,2,Alaba,1,,2,3,1,0,1,,,,10.4,1,86.5,1,,,,,,,,,,,,,-1.3,13.899562,,1
277M,,Ethiopia,2,Alaba,1,,2,35,1,0,1,2,,,47,1,157.7,1,18.898811,,2,,,,,,,,,,,,1,1
278C,,Ethiopia,2,Alaba,1,,1,1.92,1,0,1,,3,,11.7,1,81.3,1,,,,,,,,,,,,,1.41,17.701284,,1
278M,,Ethiopia,2,Alaba,1,,2,32,1,0,1,2,,,52.05,1,159.5,1,20.459705,,2,,,,,,,,,,,,1,1
279C,,Ethiopia,2,Alaba,1,,2,.92,1,0,1,,3,,7.65,1,67,1,,,,,,,,,,,,,.35,17.041656,,1
279M,,Ethiopia,2,Alaba,1,,2,32,1,0,1,2,,,51.9,1,155.5,1,21.463799,,2,,,,,,,,,,,,1,1
282C,,Ethiopia,2,Alaba,1,,1,1.25,1,0,1,,3,,8.35,1,70.5,1,,,,,,,,,,,,,.27,16.799959,,1
282M,,Ethiopia,2,Alaba,1,,2,32,1,0,1,2,,,47.1,1,158.1,1,18.843309,,2,,,,,,,,,,,,1,1
288C,,Ethiopia,2,Alaba,1,,2,1.25,1,4,1,,3,,9.199999999999999,1,69.40000000000001,1,,,,,,,,,,,,,1.92,19.101563,,1
288M,,Ethiopia,2,Alaba,1,,2,28,1,4,1,2,,,54.5,1,156.2,1,22.337494,,2,,,,,,,,,,,,1,1
289C,,Ethiopia,2,Alaba,1,,2,3,1,0,1,,3,,9,1,80.3,1,,,,,,,,,,,,,-1.16,13.957622,,1
289M,,Ethiopia,2,Alaba,1,,2,30,1,0,1,2,,,37.75,1,147,1,17.469572,,1,,,,,,,,,,,,1,1
293C,,Ethiopia,2,Alaba,1,,1,1.5,1,0,1,,3,,7.85,1,73.09999999999999,1,,,,,,,,,,,,,-1.05,14.690443,,1
293M,,Ethiopia,2,Alaba,1,,2,25,1,0,1,2,,,47.4,1,160.4,1,18.423393,,1,,,,,,,,,,,,1,1
294C,,Ethiopia,2,Alaba,1,,1,.83,1,0,1,,3,,7.2,1,69,1,,,,,,,,,,,,,-1.53,15.122873,,1
294M,,Ethiopia,2,Alaba,1,,2,35,1,0,1,2,,,48.85,1,168.8,1,17.144297,,1,,,,,,,,,,,,1,1
295C,,Ethiopia,2,Alaba,1,,1,2,1,0,1,,,,7.5,1,71.3,1,,,,,,,,,,,,,-1.07,14.753063,,1
295M,,Ethiopia,2,Alaba,1,,2,25,1,0,1,1,,,43.4,1,150.55,1,19.148211,,2,,,,,,,,,,,,1,1
304C,,Ethiopia,2,Alaba,1,,2,3,1,0,1,,,,9.6,1,78.8,1,,,,,,,,,,,,,.05,15.460331,,1
304M,,Ethiopia,2,Alaba,1,,2,26,1,0,1,1,,,46.25,1,160.2,1,18.021324,,1,,,,,,,,,,,,1,1
305C,,Ethiopia,2,Alaba,1,,1,.92,1,0,1,,3,,8.550000000000001,1,68.8,1,,,,,,,,,,,,,.79,18.062973,,1
305M,,Ethiopia,2,Alaba,1,,2,26,1,0,1,2,,,60.6,1,164.5,1,22.394472,,2,,,,,,,,,,,,1,1
306C,,Ethiopia,2,Alaba,1,,2,3,1,0,1,,0,,10.25,1,82,1,,,,,,,,,,,,,-.11,15.243902,,1
306M,,Ethiopia,2,Alaba,1,,2,48,1,0,1,3,,,42,1,146.8,1,19.489342,,2,,,,,,,,,,,,1,1
309C,,Ethiopia,2,Alaba,1,,1,1.67,1,0,1,,3,,8.550000000000001,1,75,1,,,,,,,,,,,,,-.67,15.2,,1
309M,,Ethiopia,2,Alaba,1,,2,25,1,0,1,2,,,44.7,1,159.2,1,17.636866,,1,,,,,,,,,,,,1,1
320C,,Ethiopia,2,Alaba,1,,1,2,1,0,1,,,,10.7,1,83,1,,,,,,,,,,,,,-.35,15.532007,,1
320M,,Ethiopia,2,Alaba,1,,2,35,1,0,1,2,,,49.35,1,162.4,1,18.711781,,2,,,,,,,,,,,,1,1
325C,,Ethiopia,2,Alaba,1,,1,.25,1,0,1,,3,,5.8,1,63.4,1,,,,,,,,,,,,,-1.89,14.42944,,1
325M,,Ethiopia,2,Alaba,1,,2,30,1,0,1,2,,,44.05,1,157,1,17.870907,,1,,,,,,,,,,,,1,1
327C,,Ethiopia,2,Alaba,1,,2,3,1,0,1,,,,11.15,1,83,1,,,,,,,,,,,,,.57,16.185223,,1
327M,,Ethiopia,2,Alaba,1,,2,35,1,0,1,1,,,62.6,1,159.2,1,24.699503,,2,,,,,,,,,,,,1,1
329C,,Ethiopia,2,Alaba,1,,2,2,1,0,1,,,,9.300000000000001,1,81.59999999999999,1,,,,,,,,,,,,,-1.34,13.966984,,1
329M,,Ethiopia,2,Alaba,1,,2,30,1,0,1,1,,,51.5,1,165.6,1,18.77961,,2,,,,,,,,,,,,1,1
32C,,Ethiopia,2,Alaba,1,,2,.33,1,0,1,,3,,8.1,1,68.90000000000001,1,,,,,,,,,,,,,.23,17.062654,,1
32M,,Ethiopia,2,Alaba,1,,2,32,1,0,1,2,,,48.85,1,156.2,1,20.021772,,2,,,,,,,,,,,,1,1
330C,,Ethiopia,2,Alaba,1,,1,2,1,0,1,,,,6.9,1,70.59999999999999,1,,,,,,,,,,,,,-1.85,13.843302,,1
330M,,Ethiopia,2,Alaba,1,,2,28,1,0,1,2,,,39.5,1,146.2,1,18.480017,,1,,,,,,,,,,,,1,1
331C,,Ethiopia,2,Alaba,1,,2,2,1,0,1,,,,7.25,1,73.90000000000001,1,,,,,,,,,,,,,-1.83,13.275446,,1
331M,,Ethiopia,2,Alaba,1,,2,32,1,0,1,1,,,52.2,1,155.8,1,21.504808,,2,,,,,,,,,,,,1,1
334C,,Ethiopia,2,Alaba,1,,1,.92,1,3,1,,3,,8.1,1,72,1,,,,,,,,,,,,,-.99,15.625,,1
334M,,Ethiopia,2,Alaba,1,,2,20,1,3,1,2,,,46.9,1,154.7,1,19.597118,,2,,,,,,,,,,,,1,1
336C,,Ethiopia,2,Alaba,1,,1,1.08,1,0,1,,3,,8.050000000000001,1,70,1,,,,,,,,,,,,,-.17,16.428572,,1
336M,,Ethiopia,2,Alaba,1,,2,25,1,0,1,2,,,46.2,1,150.2,1,20.478687,,2,,,,,,,,,,,,1,1
337C,,Ethiopia,2,Alaba,1,,2,1.75,1,0,1,,3,,8.699999999999999,1,74.3,1,,,,,,,,,,,,,.18,15.759471,,1
337M,,Ethiopia,2,Alaba,1,,2,26,1,0,1,2,,,50.95,1,153.7,1,21.567333,,2,,,,,,,,,,,,1,1
339C,,Ethiopia,2,Alaba,1,,2,.58,1,0,1,,3,,6.3,1,63.6,1,,,,,,,,,,,,,-1.33,15.574938,,1
339M,,Ethiopia,2,Alaba,1,,2,35,1,0,1,2,,,49.9,1,156.8,1,20.295906,,2,,,,,,,,,,,,1,1
340C,,Ethiopia,2,Alaba,1,,2,1.08,1,0,1,,3,,6.65,1,67.40000000000001,1,,,,,,,,,,,,,-1.23,14.638678,,1
340M,,Ethiopia,2,Alaba,1,,2,23,1,0,1,2,,,56.05,1,155.5,1,23.180075,,2,,,,,,,,,,,,1,1
341C,,Ethiopia,2,Alaba,1,,1,4,1,0,1,,0,,12.85,1,90.3,1,,,,,,,,,,,,,.28,15.758963,,1
341M,,Ethiopia,2,Alaba,1,,2,26,1,0,1,1,,,52.6,1,153.1,1,22.440647,,2,,,,,,,,,,,,1,1
342C,,Ethiopia,2,Alaba,1,,2,1.67,1,2,1,,,,8.550000000000001,1,73.09999999999999,1,,,,,,,,,,,,,.28,16.00042,,1
342M,,Ethiopia,2,Alaba,1,,2,25,1,2,1,1,,,58.15,1,154.2,1,24.45575,,2,,,,,,,,,,,,1,1
344C,,Ethiopia,2,Alaba,1,,2,.92,1,0,1,,3,,6.5,1,64.5,1,,,,,,,,,,,,,-.62,15.624061,,1
344M,,Ethiopia,2,Alaba,1,,2,30,1,0,1,2,,,46.8,1,161,1,18.054859,,1,,,,,,,,,,,,1,1
345C,,Ethiopia,2,Alaba,1,,2,1.58,1,0,1,,3,,11.5,1,84.59999999999999,1,,,,,,,,,,,,,.31,16.067825,,1
345M,,Ethiopia,2,Alaba,1,,2,31,1,0,1,2,,,47.5,1,155.2,1,19.720148,,2,,,,,,,,,,,,1,1
352C,,Ethiopia,2,Alaba,1,,1,2,1,0,1,,,,10.03,1,81.90000000000001,1,,,,,,,,,,,,,-.73,14.953165,,1
352M,,Ethiopia,2,Alaba,1,,2,25,1,0,1,0,,,59.5,1,155.2,1,24.70208,,2,,,,,,,,,,,,1,1
353C,,Ethiopia,2,Alaba,1,,1,2,1,0,1,,,,9.6,1,82,1,,,,,,,,,,,,,-1.49,14.277216,,1
353M,,Ethiopia,2,Alaba,1,,2,20,1,0,1,2,,,50.75,1,162.4,1,19.242611,,2,,,,,,,,,,,,1,1
355C,,Ethiopia,2,Alaba,1,,2,3,1,3,1,,,,9.800000000000001,1,83,1,,,,,,,,,,,,,-1.07,14.225577,,1
355M,,Ethiopia,2,Alaba,1,,2,24,1,3,1,1,,,50.2,1,151.4,1,21.900396,,2,,,,,,,,,,,,1,1
356C,,Ethiopia,2,Alaba,1,,1,1.25,2,8,1,,0,,8.300000000000001,1,74.90000000000001,1,,,,,,,,,,,,,-1.35,14.794983,,1
356M,,Ethiopia,2,Alaba,1,,2,20,2,8,1,1,,,62.75,1,167.2,1,22.446115,,2,,,,,,,,,,,,1,1
358C,,Ethiopia,2,Alaba,1,,2,1.83,1,0,1,,3,,9.15,1,77.40000000000001,1,,,,,,,,,,,,,-.15,15.273521,,1
358M,,Ethiopia,2,Alaba,1,,2,30,1,0,1,2,,,48.35,1,162,1,18.423258,,1,,,,,,,,,,,,1,1
361C,,Ethiopia,2,Alaba,1,,1,1,1,0,1,,3,,8.1,1,68.59999999999999,1,,,,,,,,,,,,,.26,17.212215,,1
361M,,Ethiopia,2,Alaba,1,,2,18,1,0,1,2,,,43.3,1,153.8,1,,,,,,,,,,,,,,18.305231,1,1
370C,,Ethiopia,2,Alaba,1,,1,2,1,0,1,,,,10.6,1,84.2,1,,,,,,,,,,,,,-.79,14.951394,,1
370M,,Ethiopia,2,Alaba,1,,2,25,1,0,1,2,,,46.8,1,157.5,1,18.866213,,2,,,,,,,,,,,,1,1
380C,,Ethiopia,2,Alaba,1,,2,1.67,1,0,1,,3,,8,1,73.09999999999999,1,,,,,,,,,,,,,-.47,14.971152,,1
380M,,Ethiopia,2,Alaba,1,,2,26,1,0,1,2,,,41.55,1,155.4,1,17.205568,,1,,,,,,,,,,,,1,1
387C,,Ethiopia,2,Alaba,1,,2,1.83,1,0,1,,0,,8.1,1,78.40000000000001,1,,,,,,,,,,,,,-1.95,13.178102,,1
387M,,Ethiopia,2,Alaba,1,,2,30,1,0,1,3,,,55.9,1,154.9,1,23.297482,,2,,,,,,,,,,,,1,1
397C,,Ethiopia,2,Alaba,1,,1,3,2,7,1,,,,10.5,1,82.40000000000001,1,,,,,,,,,,,,,-.19,15.464464,,1
397M,,Ethiopia,2,Alaba,1,,2,25,2,7,1,0,,,45.4,1,149.6,1,20.285824,,2,,,,,,,,,,,,1,1
398C,,Ethiopia,2,Alaba,1,,1,.92,1,0,1,,3,,5.25,1,64,1,,,,,,,,,,,,,-3.63,12.817383,,1
398M,,Ethiopia,2,Alaba,1,,2,25,1,0,1,2,,,48.05,1,150.45,1,21.227997,,2,,,,,,,,,,,,1,1
404C,,Ethiopia,2,Alaba,1,,1,2,1,0,1,,3,,9.65,1,78.59999999999999,1,,,,,,,,,,,,,-.1,15.620043,,1
404M,,Ethiopia,2,Alaba,1,,2,35,1,0,1,2,,,52.4,1,153,1,22.384552,,2,,,,,,,,,,,,1,1
405C,,Ethiopia,2,Alaba,1,,2,1.25,1,0,1,,0,,9.800000000000001,1,81.40000000000001,1,,,,,,,,,,,,,-.92,14.79031,,1
405M,,Ethiopia,2,Alaba,1,,2,36,1,0,1,1,,,52.7,1,163,1,19.835146,,2,,,,,,,,,,,,1,1
407C,,Ethiopia,2,Alaba,1,,1,1.25,1,0,1,,0,,9.15,1,74,1,,,,,,,,,,,,,1.08,16.709276,,1
407M,,Ethiopia,2,Alaba,1,,2,25,1,0,1,1,,,44.95,1,153.8,1,19.002775,,2,,,,,,,,,,,,1,1
411C,,Ethiopia,2,Alaba,1,,2,3,1,0,1,,,,10.55,1,85.2,1,,,,,,,,,,,,,-.6800000000000001,14.533603,,1
411M,,Ethiopia,2,Alaba,1,,2,32,1,0,1,0,,,44.2,1,152.7,1,18.955891,,2,,,,,,,,,,,,1,1
412C,,Ethiopia,2,Alaba,1,,2,3,1,0,1,,,,10.05,1,83.90000000000001,1,,,,,,,,,,,,,-1,14.27717,,1
412M,,Ethiopia,2,Alaba,1,,2,25,1,0,1,1,,,47.75,1,153,1,20.398138,,2,,,,,,,,,,,,1,1
414C,,Ethiopia,1,East Shewa,1,,1,3,1,0,1,,,,12.5,1,86.8,1,,,,,,,,,,,,,.8,16.590923,,1
414M,,Ethiopia,1,East Shewa,1,,2,35,1,0,1,1,,,50.4,1,156.3,1,20.630634,,2,,,,,,,,,,,,1,1
416C,,Ethiopia,1,East Shewa,1,,1,3,1,0,1,,,,12.15,1,84.5,1,,,,,,,,,,,,,.9300000000000001,17.016211,,1
416M,,Ethiopia,1,East Shewa,1,,2,30,1,0,1,1,,,45.55,1,154.5,1,19.082331,,2,,,,,,,,,,,,1,1
418C,,Ethiopia,1,East Shewa,1,,1,3,1,0,1,,3,,10.85,1,81.90000000000001,1,,,,,,,,,,,,,.36,16.175657,,1
418M,,Ethiopia,1,East Shewa,1,,2,29,1,0,1,2,,,56.4,1,161.2,1,21.704462,,2,,,,,,,,,,,,1,1
419C,,Ethiopia,1,East Shewa,1,,2,.58,1,0,1,,3,,6.2,1,67,1,,,,,,,,,,,,,-2.29,13.81154,,1
419M,,Ethiopia,1,East Shewa,1,,2,16,1,0,1,2,,,42.15,1,156.2,1,,,,,,,,,,,,,,17.275694,1,1
41C,,Ethiopia,2,Alaba,1,,2,.67,1,0,1,,,,7.15,1,65.09999999999999,1,,,,,,,,,,,,,.02,16.871126,,1
41M,,Ethiopia,2,Alaba,1,,2,46,1,0,1,2,,,39.4,1,160.1,1,15.371405,,1,,,,,,,,,,,,1,1
421C,,Ethiopia,1,East Shewa,1,,1,1.75,1,0,1,,3,,9.6,1,75.59999999999999,1,,,,,,,,,,,,,.69,16.796843,,1
421M,,Ethiopia,1,East Shewa,1,,2,35,1,0,1,2,,,75.5,1,153.85,1,31.897156,,4,,,,,,,,,,,,1,1
423C,,Ethiopia,1,East Shewa,1,,1,5,1,0,1,,,,14.35,1,98,1,,,,,,,,,,,,,-.24,14.941691,,1
423M,,Ethiopia,1,East Shewa,1,,2,38,1,0,1,0,,,54.25,1,152,1,23.480783,,2,,,,,,,,,,,,1,1
424C,,Ethiopia,1,East Shewa,1,,1,5,1,0,1,,,,12.9,1,93.45,1,,,,,,,,,,,,,-.37,14.771721,,1
424M,,Ethiopia,1,East Shewa,1,,2,32,1,0,1,1,,,54.55,1,154.8,1,22.764223,,2,,,,,,,,,,,,1,1
426C,,Ethiopia,1,East Shewa,1,,2,1.92,1,0,1,,0,,12.5,1,85.15000000000001,1,,,,,,,,,,,,,1.25,17.240137,,1
426M,,Ethiopia,1,East Shewa,1,,2,35,1,0,1,0,,,53.25,1,160.65,1,20.632799,,2,,,,,,,,,,,,1,1
429C,,Ethiopia,1,East Shewa,1,,2,.92,1,0,1,,3,,7.85,1,71.90000000000001,1,,,,,,,,,,,,,-.99,15.184897,,1
429M,,Ethiopia,1,East Shewa,1,,2,30,1,0,1,1,,,49.6,1,153.4,1,21.078075,,2,,,,,,,,,,,,1,1
430C,,Ethiopia,1,East Shewa,1,,2,1.33,1,3,1,,3,,8.75,1,75.5,1,,,,,,,,,,,,,-.42,15.350204,,1
430M,,Ethiopia,1,East Shewa,1,,2,30,1,3,1,2,,,50,1,162.9,1,18.842037,,2,,,,,,,,,,,,1,1
432C,,Ethiopia,1,East Shewa,1,,1,4,1,0,1,,3,,13.2,1,93.3,1,,,,,,,,,,,,,-.15,15.163891,,1
432M,,Ethiopia,1,East Shewa,1,,2,28,1,0,1,2,,,44.3,1,149,1,19.954056,,2,,,,,,,,,,,,1,1
437C,,Ethiopia,1,East Shewa,1,,2,2,1,0,1,,3,,10.85,1,86.5,1,,,,,,,,,,,,,-.86,14.500986,,1
437M,,Ethiopia,1,East Shewa,1,,2,30,1,0,1,2,,,48.7,1,158.1,1,19.483421,,2,,,,,,,,,,,,1,1
438C,,Ethiopia,1,East Shewa,1,,1,5,1,0,1,,3,,5,1,,,,,,,,,,,,,,,,,,1
438M,,Ethiopia,1,East Shewa,1,,2,37,1,0,1,2,,,57.6,1,162.9,1,21.706026,,2,,,,,,,,,,,,1,1
440C,,Ethiopia,1,East Shewa,1,,1,.33,1,5,1,,3,,5.85,1,62.8,1,,,,,,,,,,,,,-1.26,14.833259,,1
440M,,Ethiopia,1,East Shewa,1,,2,29,1,5,1,2,,,56.9,1,154,1,23.992241,,2,,,,,,,,,,,,1,1
441C,,Ethiopia,1,East Shewa,1,,2,3,1,0,1,,3,,8.449999999999999,1,75,1,,,,,,,,,,,,,-.4,15.022223,,1
441M,,Ethiopia,1,East Shewa,1,,2,25,1,0,1,2,,,47.75,1,147.25,1,22.022305,,2,,,,,,,,,,,,1,1
444C,,Ethiopia,1,East Shewa,1,,1,3,1,0,1,,,,13.9,1,94.59999999999999,1,,,,,,,,,,,,,.05,15.532184,,1
444M,,Ethiopia,1,East Shewa,1,,2,30,1,0,1,0,,,50.8,1,159.95,1,19.856157,,2,,,,,,,,,,,,1,1
446C,,Ethiopia,1,East Shewa,1,,2,1.92,1,3,1,,3,,8.85,1,78,1,,,,,,,,,,,,,-.72,14.546351,,1
446M,,Ethiopia,1,East Shewa,1,,2,19,1,3,1,2,,,50.85,1,161.2,1,,,,,,,,,,,,,,19.568651,1,1
447C,,Ethiopia,1,East Shewa,1,,2,3,1,0,1,,0,,10.45,1,85,1,,,,,,,,,,,,,-.74,14.463668,,1
447M,,Ethiopia,1,East Shewa,1,,2,35,1,0,1,3,,,46.5,1,156.8,1,18.913017,,2,,,,,,,,,,,,1,1
448C,,Ethiopia,1,East Shewa,1,,1,.83,1,0,1,,3,,7.65,1,71,1,,,,,,,,,,,,,-1.44,15.17556,,1
448M,,Ethiopia,1,East Shewa,1,,2,20,1,0,1,2,,,45,1,156.45,1,18.384905,,1,,,,,,,,,,,,1,1
44C,,Ethiopia,2,Alaba,1,,2,2,1,5,1,,3,,9.300000000000001,1,77.09999999999999,1,,,,,,,,,,,,,-.02,15.644951,,1
44M,,Ethiopia,2,Alaba,1,,2,18,1,5,1,2,,,39.8,1,148.9,1,,,,,,,,,,,,,,17.951208,1,1
453C,,Ethiopia,1,East Shewa,1,,2,1.17,1,0,1,,3,,9.15,1,73.8,1,,,,,,,,,,,,,.45,16.799965,,1
453M,,Ethiopia,1,East Shewa,1,,2,22,1,0,1,2,,,45,1,154.45,1,18.864126,,2,,,,,,,,,,,,1,1
455C,,Ethiopia,1,East Shewa,1,,2,1.92,1,3,1,,,,9.9,1,79,1,,,,,,,,,,,,,.32,15.862843,,1
455M,,Ethiopia,1,East Shewa,1,,2,23,1,3,1,2,,,59.15,1,164.7,1,21.805574,,2,,,,,,,,,,,,1,1