id,hh_id,country,sec_area,tert_area,round,smpl_weight,sex,age,edc_level,edc,residence,preg_lact,breastfeeding,hh_head,wgt,wgt_method,hgt,hgt_method,bmi_adults,bmi_children,bmi_cat,misrep,pa,pa_cat,smok,special_diet,special_diet_other,clin_diet,clin_diet_other,note,bmi_chld
1,,Democratic Republic of the Congo,Equateur,Sud-Ubangi,1,,2,34,1,primary,1,1,,,52.700001,1,160.89999,1,20.356287,,2,,,,,0,,0,,,
2,,Democratic Republic of the Congo,Equateur,Sud-Ubangi,1,,2,31,1,primary,1,1,,,48.400002,1,168.7,1,17.006512,,1,,,,,0,,0,,,
3,,Democratic Republic of the Congo,Equateur,Sud-Ubangi,1,,2,21,1,primary,1,1,,,,,158,1,,,,,,,,0,,0,,Missing value for weight,
4,,Democratic Republic of the Congo,Equateur,Sud-Ubangi,1,,2,27,1,no formal schooling,1,1,,,59,1,162.5,1,22.343195,,2,,,,,0,,0,,,
5,,Democratic Republic of the Congo,Equateur,Sud-Ubangi,1,,2,25,2,secondary,1,1,,,37.700001,1,147.7,1,17.281458,,1,,,,,0,,0,,,
6,,Democratic Republic of the Congo,Equateur,Sud-Ubangi,1,,2,22,2,secondary,1,1,,,41.400002,1,147,1,19.158684,,2,,,,,0,,0,,,
7,,Democratic Republic of the Congo,Equateur,Sud-Ubangi,1,,2,32,2,secondary,1,1,,,49.900002,1,156,1,20.504602,,2,,,,,0,,0,,,
8,,Democratic Republic of the Congo,Equateur,Sud-Ubangi,1,,2,18,2,secondary,1,1,,,60.900002,1,159.2,1,,,,,,,,0,,0,,,24.028751
9,,Democratic Republic of the Congo,Equateur,Sud-Ubangi,1,,2,33,2,secondary,1,1,,,64.400002,1,161.2,1,24.783112,,2,,,,,0,,0,,,
10,,Democratic Republic of the Congo,Equateur,Sud-Ubangi,1,,2,21,1,primary,1,1,,,,,161.10001,1,,,,,,,,0,,0,,Missing value for weight,
11,,Democratic Republic of the Congo,Equateur,Sud-Ubangi,1,,2,29,1,no formal schooling,1,1,,,49.799999,1,153.2,1,21.218361,,2,,,,,0,,0,,,
12,,Democratic Republic of the Congo,Equateur,Sud-Ubangi,1,,2,23,2,secondary,1,1,,,51.400002,1,153.10001,1,21.928692,,2,,,,,0,,0,,,
13,,Democratic Republic of the Congo,Equateur,Sud-Ubangi,1,,2,27,1,primary,1,1,,,47.799999,1,154.5,1,20.024925,,2,,,,,0,,0,,,
14,,Democratic Republic of the Congo,Equateur,Sud-Ubangi,1,,2,27,2,secondary,1,1,,,75.5,1,162,1,28.76848,,3,,,,,0,,0,,,
15,,Democratic Republic of the Congo,Equateur,Sud-Ubangi,1,,2,24,1,no formal schooling,1,1,,,51,1,167.5,1,18.177769,,1,,,,,0,,0,,,
16,,Democratic Republic of the Congo,Equateur,Sud-Ubangi,1,,2,22,1,primary,1,1,,,,,153,1,,,,,,,,0,,0,,Missing value for weight,
17,,Democratic Republic of the Congo,Equateur,Sud-Ubangi,1,,2,32,1,primary,1,1,,,40,1,150,1,17.777779,,1,,,,,0,,0,,,
18,,Democratic Republic of the Congo,Equateur,Sud-Ubangi,1,,2,25,2,secondary,1,1,,,55,1,157.5,1,22.171831,,2,,,,,0,,0,,,
19,,Democratic Republic of the Congo,Equateur,Sud-Ubangi,1,,2,23,1,primary,1,1,,,61.099998,1,161,1,23.571621,,2,,,,,0,,0,,,
20,,Democratic Republic of the Congo,Equateur,Sud-Ubangi,1,,2,23,1,primary,1,1,,,56.200001,1,160,1,21.953125,,2,,,,,0,,0,,,
21,,Democratic Republic of the Congo,Equateur,Sud-Ubangi,1,,2,21,1,no formal schooling,1,1,,,49.299999,1,166,1,17.890841,,1,,,,,0,,0,,,
22,,Democratic Republic of the Congo,Equateur,Sud-Ubangi,1,,2,21,2,secondary,1,1,,,59.400002,1,157.5,1,23.94558,,2,,,,,0,,0,,,
23,,Democratic Republic of the Congo,Equateur,Sud-Ubangi,1,,2,23,1,primary,1,1,,,50.799999,1,159,1,20.094141,,2,,,,,0,,0,,,
24,,Democratic Republic of the Congo,Equateur,Sud-Ubangi,1,,2,28,1,primary,1,1,,,62.299999,1,162.5,1,23.592899,,2,,,,,0,,0,,,
25,,Democratic Republic of the Congo,Equateur,Sud-Ubangi,1,,2,30,2,secondary,1,1,,,59,1,157,1,23.936062,,2,,,,,0,,0,,,
26,,Democratic Republic of the Congo,Equateur,Sud-Ubangi,1,,2,33,1,primary,1,1,,,51.299999,1,158.5,1,20.420145,,2,,,,,0,,0,,,
27,,Democratic Republic of the Congo,Equateur,Sud-Ubangi,1,,2,30,1,primary,1,1,,,48.700001,1,151.89999,1,21.106365,,2,,,,,0,,0,,,
28,,Democratic Republic of the Congo,Equateur,Sud-Ubangi,1,,2,26,2,secondary,1,1,,,61.200001,1,166,1,22.20932,,2,,,,,0,,0,,,
30,,Democratic Republic of the Congo,Equateur,Sud-Ubangi,1,,2,21,1,primary,1,1,,,52.799999,1,165.5,1,19.276932,,2,,,,,0,,0,,,
31,,Democratic Republic of the Congo,Equateur,Sud-Ubangi,1,,2,19,2,secondary,1,1,,,,,160,1,,,,,,,,0,,0,,Missing value for weight,
32,,Democratic Republic of the Congo,Equateur,Sud-Ubangi,1,,2,34,1,primary,1,1,,,50.099998,1,149.10001,1,22.536289,,2,,,,,0,,0,,,
33,,Democratic Republic of the Congo,Equateur,Sud-Ubangi,1,,2,17,1,no formal schooling,1,1,,,53.5,1,165,1,,,,,,,,0,,0,,,19.651056
34,,Democratic Republic of the Congo,Equateur,Sud-Ubangi,1,,2,21,1,primary,1,1,,,45.5,1,150.8,1,20.00823,,2,,,,,0,,0,,,
35,,Democratic Republic of the Congo,Equateur,Sud-Ubangi,1,,2,19,1,primary,1,1,,,58.299999,1,159.3,1,,,,,,,,0,,0,,,22.97402
36,,Democratic Republic of the Congo,Equateur,Sud-Ubangi,1,,2,20,1,primary,1,1,,,51.200001,1,162.39999,1,19.413237,,2,,,,,0,,0,,,
37,,Democratic Republic of the Congo,Equateur,Sud-Ubangi,1,,2,19,1,primary,1,1,,,51.700001,1,155.8,1,,,,,,,,0,,0,,,21.298824
38,,Democratic Republic of the Congo,Equateur,Sud-Ubangi,1,,2,23,2,secondary,1,1,,,53.599998,1,161.39999,1,20.575848,,2,,,,,0,,0,,,
39,,Democratic Republic of the Congo,Equateur,Sud-Ubangi,1,,2,22,1,primary,1,1,,,52.599998,1,158.5,1,20.937614,,2,,,,,0,,0,,,
40,,Democratic Republic of the Congo,Equateur,Sud-Ubangi,1,,2,21,1,primary,1,1,,,45.099998,1,151.10001,1,19.75366,,2,,,,,0,,0,,,
41,,Democratic Republic of the Congo,Equateur,Sud-Ubangi,1,,2,18,1,primary,1,1,,,39.099998,1,147.10001,1,,,,,,,,0,,0,,,18.069717
42,,Democratic Republic of the Congo,Equateur,Sud-Ubangi,1,,2,17,1,primary,1,1,,,50.099998,1,153.3,1,,,,,,,,0,,0,,,21.31834
43,,Democratic Republic of the Congo,Equateur,Sud-Ubangi,1,,2,25,1,no formal schooling,1,1,,,50.599998,1,161.10001,1,19.496622,,2,,,,,0,,0,,,
44,,Democratic Republic of the Congo,Equateur,Sud-Ubangi,1,,2,26,1,no formal schooling,1,1,,,35.700001,1,141,1,17.956844,,1,,,,,0,,0,,,
45,,Democratic Republic of the Congo,Equateur,Sud-Ubangi,1,,2,22,1,no formal schooling,1,1,,,50.799999,1,163.39999,1,19.026531,,2,,,,,0,,0,,,
46,,Democratic Republic of the Congo,Equateur,Sud-Ubangi,1,,2,26,1,primary,1,1,,,49.700001,1,152.39999,1,21.398657,,2,,,,,0,,0,,,
47,,Democratic Republic of the Congo,Equateur,Sud-Ubangi,1,,2,31,1,no formal schooling,1,1,,,49.099998,1,151.10001,1,21.505648,,2,,,,,0,,0,,,
48,,Democratic Republic of the Congo,Equateur,Sud-Ubangi,1,,2,31,1,no formal schooling,1,1,,,46.299999,1,153,1,19.778717,,2,,,,,0,,0,,,
49,,Democratic Republic of the Congo,Equateur,Sud-Ubangi,1,,2,34,1,primary,1,1,,,50.599998,1,153,1,21.615618,,2,,,,,0,,0,,,
50,,Democratic Republic of the Congo,Equateur,Sud-Ubangi,1,,2,19,1,primary,1,1,,,51.900002,1,156,1,,,,,,,,0,,0,,,21.326431
51,,Democratic Republic of the Congo,Equateur,Sud-Ubangi,1,,2,28,1,primary,1,1,,,42.200001,1,152,1,18.265236,,1,,,,,0,,0,,,
52,,Democratic Republic of the Congo,Equateur,Sud-Ubangi,1,,2,29,1,no formal schooling,1,1,,,59.299999,1,165,1,21.78145,,2,,,,,0,,0,,,
53,,Democratic Republic of the Congo,Equateur,Sud-Ubangi,1,,2,23,1,no formal schooling,1,1,,,51.599998,1,155,1,21.477627,,2,,,,,0,,0,,,
54,,Democratic Republic of the Congo,Equateur,Sud-Ubangi,1,,2,23,1,no formal schooling,1,1,,,55.599998,1,155,1,23.142559,,2,,,,,0,,0,,,
55,,Democratic Republic of the Congo,Equateur,Sud-Ubangi,1,,2,22,1,no formal schooling,1,1,,,54.299999,1,161,1,20.948265,,2,,,,,0,,0,,,
56,,Democratic Republic of the Congo,Equateur,Sud-Ubangi,1,,2,27,1,no formal schooling,1,1,,,51.799999,1,160,1,20.234375,,2,,,,,0,,0,,,
57,,Democratic Republic of the Congo,Equateur,Sud-Ubangi,1,,2,18,2,secondary,1,1,,,59.900002,1,156.5,1,,,,,,,,0,,0,,,24.456717
58,,Democratic Republic of the Congo,Equateur,Sud-Ubangi,1,,2,24,1,no formal schooling,1,1,,,41.900002,1,147.5,1,19.258835,,2,,,,,0,,0,,,
59,,Democratic Republic of the Congo,Equateur,Sud-Ubangi,1,,2,18,1,primary,1,1,,,41.5,1,153,1,,,,,,,,0,,0,,,17.728224
60,,Democratic Republic of the Congo,Equateur,Sud-Ubangi,1,,2,19,1,primary,1,1,,,68.199997,1,162,1,,,,,,,,0,,0,,,25.986891
61,,Democratic Republic of the Congo,Equateur,Sud-Ubangi,1,,2,25,1,no formal schooling,1,1,,,47.299999,1,150,1,21.022223,,2,,,,,0,,0,,,
62,,Democratic Republic of the Congo,Equateur,Sud-Ubangi,1,,2,29,1,primary,1,1,,,60,1,156,1,24.654833,,2,,,,,0,,0,,,
63,,Democratic Republic of the Congo,Equateur,Sud-Ubangi,1,,2,22,1,no formal schooling,1,1,,,54.799999,1,156,1,22.51808,,2,,,,,0,,0,,,
64,,Democratic Republic of the Congo,Equateur,Sud-Ubangi,1,,2,26,1,primary,1,1,,,46,1,153,1,19.650562,,2,,,,,0,,0,,,
65,,Democratic Republic of the Congo,Equateur,Sud-Ubangi,1,,2,19,1,primary,1,1,,,,,147.3,1,,,,,,,,0,,0,,Missing value for weight,
66,,Democratic Republic of the Congo,Equateur,Sud-Ubangi,1,,2,28,2,secondary,1,1,,,55.099998,1,162,1,20.995274,,2,,,,,0,,0,,,
67,,Democratic Republic of the Congo,Equateur,Sud-Ubangi,1,,2,21,1,primary,1,1,,,46.799999,1,152,1,20.256233,,2,,,,,0,,0,,,
68,,Democratic Republic of the Congo,Equateur,Sud-Ubangi,1,,2,20,1,primary,1,1,,,,,154.5,1,,,,,,,,0,,0,,Missing value for weight,
69,,Democratic Republic of the Congo,Equateur,Sud-Ubangi,1,,2,31,2,secondary,1,1,,,66.199997,1,159,1,26.185673,,3,,,,,0,,0,,,
70,,Democratic Republic of the Congo,Equateur,Sud-Ubangi,1,,2,18,2,secondary,1,1,,,55.200001,1,161.39999,1,,,,,,,,0,,0,,,21.190054
71,,Democratic Republic of the Congo,Equateur,Sud-Ubangi,1,,2,32,1,primary,1,1,,,,,166,1,,,,,,,,0,,0,,Missing value for weight,
72,,Democratic Republic of the Congo,Equateur,Sud-Ubangi,1,,2,22,2,secondary,1,1,,,63.900002,1,164,1,23.758181,,2,,,,,0,,0,,,
73,,Democratic Republic of the Congo,Equateur,Sud-Ubangi,1,,2,22,2,secondary,1,1,,,,,152.5,1,,,,,,,,0,,0,,Missing value for weight,
74,,Democratic Republic of the Congo,Equateur,Sud-Ubangi,1,,2,18,1,primary,1,1,,,,,157,1,,,,,,,,0,,0,,Missing value for weight,
75,,Democratic Republic of the Congo,Equateur,Sud-Ubangi,1,,2,29,2,secondary,1,1,,,49.5,1,157,1,20.081951,,2,,,,,0,,0,,,
76,,Democratic Republic of the Congo,Equateur,Sud-Ubangi,1,,2,21,1,primary,1,1,,,,,157,1,,,,,,,,0,,0,,Missing value for weight,
77,,Democratic Republic of the Congo,Equateur,Sud-Ubangi,1,,2,17,2,secondary,1,1,,,50.5,1,161,1,,,,,,,,0,,0,,,19.482273
78,,Democratic Republic of the Congo,Equateur,Sud-Ubangi,1,,2,21,1,primary,1,1,,,51.900002,1,154,1,21.883961,,2,,,,,0,,0,,,
79,,Democratic Republic of the Congo,Equateur,Sud-Ubangi,1,,2,33,1,no formal schooling,1,1,,,39.299999,1,141,1,19.767616,,2,,,,,0,,0,,,
80,,Democratic Republic of the Congo,Equateur,Sud-Ubangi,1,,2,30,2,secondary,1,1,,,57.599998,1,164.10001,1,21.389729,,2,,,,,0,,0,,,
81,,Democratic Republic of the Congo,Equateur,Sud-Ubangi,1,,2,24,1,primary,1,1,,,54.5,1,157.60001,1,21.942396,,2,,,,,0,,0,,,
82,,Democratic Republic of the Congo,Equateur,Sud-Ubangi,1,,2,30,1,primary,1,1,,,40,1,158.39999,1,15.942252,,1,,,,,0,,0,,,
83,,Democratic Republic of the Congo,Equateur,Sud-Ubangi,1,,2,27,1,primary,1,1,,,,,170.60001,1,,,,,,,,0,,0,,Missing value for weight,
84,,Democratic Republic of the Congo,Equateur,Sud-Ubangi,1,,2,22,2,secondary,1,1,,,51.700001,1,155,1,21.519251,,2,,,,,0,,0,,,
85,,Democratic Republic of the Congo,Equateur,Sud-Ubangi,1,,2,31,1,no formal schooling,1,1,,,63.099998,1,166.89999,1,22.652529,,2,,,,,0,,0,,,
86,,Democratic Republic of the Congo,Equateur,Sud-Ubangi,1,,2,28,1,no formal schooling,1,1,,,55.099998,1,162.5,1,20.866272,,2,,,,,0,,0,,,
87,,Democratic Republic of the Congo,Equateur,Sud-Ubangi,1,,2,17,1,primary,1,1,,,48.200001,1,150.39999,1,,,,,,,,0,,0,,,21.308428
88,,Democratic Republic of the Congo,Equateur,Sud-Ubangi,1,,2,25,1,primary,1,1,,,45.099998,1,153.7,1,19.091005,,2,,,,,0,,0,,,
89,,Democratic Republic of the Congo,Equateur,Sud-Ubangi,1,,2,18,1,primary,1,1,,,50,1,151,1,,,,,,,,0,,0,,,21.928864
90,,Democratic Republic of the Congo,Equateur,Sud-Ubangi,1,,2,20,1,primary,1,1,,,49.400002,1,145.39999,1,23.366743,,2,,,,,0,,0,,,
92,,Democratic Republic of the Congo,Equateur,Sud-Ubangi,1,,2,30,2,secondary,1,1,,,51.200001,1,157.2,1,20.718815,,2,,,,,0,,0,,,
93,,Democratic Republic of the Congo,Equateur,Sud-Ubangi,1,,2,23,1,no formal schooling,1,1,,,52.799999,1,158.5,1,21.017225,,2,,,,,0,,0,,,
94,,Democratic Republic of the Congo,Equateur,Sud-Ubangi,1,,2,28,1,no formal schooling,1,1,,,47.400002,1,148.3,1,21.55242,,2,,,,,0,,0,,,
95,,Democratic Republic of the Congo,Equateur,Sud-Ubangi,1,,2,22,1,no formal schooling,1,1,,,42.099998,1,143,1,20.587803,,2,,,,,0,,0,,,
96,,Democratic Republic of the Congo,Equateur,Sud-Ubangi,1,,2,28,1,no formal schooling,1,1,,,55.5,1,154,1,23.401922,,2,,,,,0,,0,,,
97,,Democratic Republic of the Congo,Equateur,Sud-Ubangi,1,,2,32,1,no formal schooling,1,1,,,43.099998,1,161,1,16.627445,,1,,,,,0,,0,,,
98,,Democratic Republic of the Congo,Equateur,Sud-Ubangi,1,,2,21,1,primary,1,1,,,50.700001,1,155,1,21.103018,,2,,,,,0,,0,,,
99,,Democratic Republic of the Congo,Equateur,Sud-Ubangi,1,,2,23,1,primary,1,1,,,53.200001,1,156,1,21.860619,,2,,,,,0,,0,,,
100,,Democratic Republic of the Congo,Equateur,Sud-Ubangi,1,,2,20,1,primary,1,1,,,46.400002,1,156.5,1,18.944769,,2,,,,,0,,0,,,
101,,Democratic Republic of the Congo,Equateur,Sud-Ubangi,1,,2,22,1,primary,1,1,,,46.099998,1,154,1,19.438353,,2,,,,,0,,0,,,
102,,Democratic Republic of the Congo,Equateur,Sud-Ubangi,1,,2,19,1,primary,1,1,,,53.599998,1,148.60001,1,,,,,,,,0,,0,,,24.273205
103,,Democratic Republic of the Congo,Equateur,Sud-Ubangi,1,,2,24,2,secondary,1,1,,,42.299999,1,159.8,1,16.564823,,1,,,,,0,,0,,,
104,,Democratic Republic of the Congo,Equateur,Sud-Ubangi,1,,2,27,1,primary,1,1,,,48.599998,1,150.39999,1,21.48526,,2,,,,,0,,0,,,
105,,Democratic Republic of the Congo,Equateur,Sud-Ubangi,1,,2,21,1,primary,1,1,,,46.700001,1,161,1,18.016281,,1,,,,,0,,0,,,
106,,Democratic Republic of the Congo,Equateur,Sud-Ubangi,1,,2,19,1,primary,1,1,,,65.199997,1,159,1,,,,,,,,0,,0,,,25.790117
107,,Democratic Republic of the Congo,Equateur,Sud-Ubangi,1,,2,32,1,no formal schooling,1,1,,,,,156,1,,,,,,,,0,,0,,Missing value for weight,
108,,Democratic Republic of the Congo,Equateur,Sud-Ubangi,1,,2,28,1,no formal schooling,1,1,,,38.400002,1,148,1,17.531046,,1,,,,,0,,0,,,
109,,Democratic Republic of the Congo,Equateur,Sud-Ubangi,1,,2,24,1,primary,1,1,,,58.400002,1,156,1,23.997372,,2,,,,,0,,0,,,
110,,Democratic Republic of the Congo,Equateur,Sud-Ubangi,1,,2,30,1,primary,1,1,,,43.900002,1,159.7,1,17.212927,,1,,,,,0,,0,,,
111,,Democratic Republic of the Congo,Equateur,Sud-Ubangi,1,,2,28,1,no formal schooling,1,1,,,43,1,150,1,19.111111,,2,,,,,0,,0,,,
112,,Democratic Republic of the Congo,Equateur,Sud-Ubangi,1,,2,31,1,no formal schooling,1,1,,,45,1,160.8,1,17.403652,,1,,,,,0,,0,,,
113,,Democratic Republic of the Congo,Equateur,Sud-Ubangi,1,,2,22,1,primary,1,1,,,48.799999,1,153,1,20.846684,,2,,,,,0,,0,,,
114,,Democratic Republic of the Congo,Equateur,Sud-Ubangi,1,,2,30,1,primary,1,1,,,49.099998,1,149.5,1,21.968433,,2,,,,,0,,0,,,
115,,Democratic Republic of the Congo,Equateur,Sud-Ubangi,1,,2,25,1,no formal schooling,1,1,,,44.5,1,154,1,18.763704,,2,,,,,0,,0,,,
116,,Democratic Republic of the Congo,Equateur,Sud-Ubangi,1,,2,29,1,no formal schooling,1,1,,,58.799999,1,168,1,20.833334,,2,,,,,0,,0,,,
117,,Democratic Republic of the Congo,Equateur,Sud-Ubangi,1,,2,28,1,primary,1,1,,,42.400002,1,150,1,18.844444,,2,,,,,0,,0,,,
118,,Democratic Republic of the Congo,Equateur,Sud-Ubangi,1,,2,33,1,primary,1,1,,,52.299999,1,158.60001,1,20.791952,,2,,,,,0,,0,,,
119,,Democratic Republic of the Congo,Equateur,Sud-Ubangi,1,,2,31,1,no formal schooling,1,1,,,51.5,1,157,1,20.893343,,2,,,,,0,,0,,,
120,,Democratic Republic of the Congo,Equateur,Sud-Ubangi,1,,2,22,1,primary,1,1,,,52.5,1,156,1,21.572979,,2,,,,,0,,0,,,
121,,Democratic Republic of the Congo,Equateur,Sud-Ubangi,1,,2,29,1,no formal schooling,1,1,,,42.299999,1,153,1,18.069973,,1,,,,,0,,0,,,
122,,Democratic Republic of the Congo,Equateur,Sud-Ubangi,1,,2,22,1,no formal schooling,1,1,,,56.299999,1,153.39999,1,23.925318,,2,,,,,0,,0,,,
123,,Democratic Republic of the Congo,Equateur,Sud-Ubangi,1,,2,26,1,primary,1,1,,,44.799999,1,158,1,17.945841,,1,,,,,0,,0,,,
124,,Democratic Republic of the Congo,Equateur,Sud-Ubangi,1,,2,28,1,no formal schooling,1,1,,,51.400002,1,159.3,1,20.254969,,2,,,,,0,,0,,,
125,,Democratic Republic of the Congo,Equateur,Sud-Ubangi,1,,2,17,1,primary,1,1,,,59.900002,1,160,1,,,,,,,,0,,0,,,23.398438
126,,Democratic Republic of the Congo,Equateur,Sud-Ubangi,1,,2,20,1,primary,1,1,,,,,157.5,1,,,,,,,,0,,0,,Missing value for weight,
127,,Democratic Republic of the Congo,Equateur,Sud-Ubangi,1,,2,29,1,primary,1,1,,,53,1,148.39999,1,24.066233,,2,,,,,0,,0,,,
129,,Democratic Republic of the Congo,Equateur,Sud-Ubangi,1,,2,21,1,primary,1,1,,,55.299999,1,166,1,20.068224,,2,,,,,0,,0,,,
130,,Democratic Republic of the Congo,Equateur,Sud-Ubangi,1,,2,20,1,primary,1,1,,,48.5,1,150,1,21.555555,,2,,,,,0,,0,,,
131,,Democratic Republic of the Congo,Equateur,Sud-Ubangi,1,,2,21,1,no formal schooling,1,1,,,45.599998,1,155,1,18.980228,,2,,,,,0,,0,,,
132,,Democratic Republic of the Congo,Equateur,Sud-Ubangi,1,,2,19,1,primary,1,1,,,45.299999,1,158.60001,1,,,,,,,,0,,0,,,18.00909
133,,Democratic Republic of the Congo,Equateur,Sud-Ubangi,1,,2,18,2,secondary,1,1,,,53.099998,1,165,1,,,,,,,,0,,0,,,19.504131
134,,Democratic Republic of the Congo,Equateur,Sud-Ubangi,1,,2,22,1,no formal schooling,1,1,,,53.099998,1,165.39999,1,19.40991,,2,,,,,0,,0,,,
135,,Democratic Republic of the Congo,Equateur,Sud-Ubangi,1,,2,20,1,primary,1,1,,,50.5,1,160.5,1,19.603848,,2,,,,,0,,0,,,
136,,Democratic Republic of the Congo,Equateur,Sud-Ubangi,1,,2,25,1,primary,1,1,,,51,1,154.5,1,21.365507,,2,,,,,0,,0,,,
137,,Democratic Republic of the Congo,Equateur,Sud-Ubangi,1,,2,23,1,primary,1,1,,,44.700001,1,148.5,1,20.270041,,2,,,,,0,,0,,,
138,,Democratic Republic of the Congo,Equateur,Sud-Ubangi,1,,2,24,1,primary,1,1,,,53.400002,1,153,1,22.811739,,2,,,,,0,,0,,,
139,,Democratic Republic of the Congo,Equateur,Sud-Ubangi,1,,2,29,1,no formal schooling,1,1,,,45.200001,1,154.5,1,18.935705,,2,,,,,0,,0,,,
140,,Democratic Republic of the Congo,Equateur,Sud-Ubangi,1,,2,32,1,no formal schooling,1,1,,,51.299999,1,159.5,1,20.164896,,2,,,,,0,,0,,,
141,,Democratic Republic of the Congo,Equateur,Sud-Ubangi,1,,2,22,1,primary,1,1,,,44.599998,1,152,1,19.304016,,2,,,,,0,,0,,,
142,,Democratic Republic of the Congo,Equateur,Sud-Ubangi,1,,2,29,1,primary,1,1,,,52.299999,1,151.2,1,22.876949,,2,,,,,0,,0,,,
143,,Democratic Republic of the Congo,Equateur,Sud-Ubangi,1,,2,22,1,primary,1,1,,,,,158,1,,,,,,,,0,,0,,Missing value for weight,
144,,Democratic Republic of the Congo,Equateur,Sud-Ubangi,1,,2,28,1,primary,1,1,,,44.299999,1,158,1,17.745554,,1,,,,,0,,0,,,
145,,Democratic Republic of the Congo,Equateur,Sud-Ubangi,1,,2,27,1,no formal schooling,1,1,,,39.299999,1,145.5,1,18.563786,,2,,,,,0,,0,,,
146,,Democratic Republic of the Congo,Equateur,Sud-Ubangi,1,,2,22,1,no formal schooling,1,1,,,55.099998,1,163,1,20.738455,,2,,,,,0,,0,,,
147,,Democratic Republic of the Congo,Equateur,Sud-Ubangi,1,,2,32,1,primary,1,1,,,53,1,160,1,20.703125,,2,,,,,0,,0,,,
148,,Democratic Republic of the Congo,Equateur,Sud-Ubangi,1,,2,25,1,primary,1,1,,,54.900002,1,155,1,22.851198,,2,,,,,0,,0,,,
149,,Democratic Republic of the Congo,Equateur,Sud-Ubangi,1,,2,28,1,primary,1,1,,,48.099998,1,150.39999,1,21.264219,,2,,,,,0,,0,,,
150,,Democratic Republic of the Congo,Equateur,Sud-Ubangi,1,,2,18,1,primary,1,1,,,49.5,1,155,1,,,,,,,,0,,0,,,20.603539
151,,Democratic Republic of the Congo,Equateur,Sud-Ubangi,1,,2,28,1,primary,1,1,,,,,161,1,,,,,,,,0,,0,,Missing value for weight,
152,,Democratic Republic of the Congo,Equateur,Sud-Ubangi,1,,2,30,1,primary,1,1,,,56.799999,1,172.5,1,19.088427,,2,,,,,0,,0,,,
153,,Democratic Republic of the Congo,Equateur,Sud-Ubangi,1,,2,27,1,primary,1,1,,,54.400002,1,158,1,21.79138,,2,,,,,0,,0,,,
154,,Democratic Republic of the Congo,Equateur,Sud-Ubangi,1,,2,18,1,primary,1,1,,,44.599998,1,149.8,1,,,,,,,,0,,0,,,19.875185
155,,Democratic Republic of the Congo,Equateur,Sud-Ubangi,1,,2,31,1,no formal schooling,1,1,,,43.400002,1,153.3,1,18.467386,,1,,,,,0,,0,,,
156,,Democratic Republic of the Congo,Equateur,Sud-Ubangi,1,,2,18,1,primary,1,1,,,43.900002,1,153.89999,1,,,,,,,,0,,0,,,18.534775
157,,Democratic Republic of the Congo,Equateur,Sud-Ubangi,1,,2,17,1,primary,1,1,,,48.099998,1,154.10001,1,,,,,,,,0,,0,,,20.25535
158,,Democratic Republic of the Congo,Equateur,Sud-Ubangi,1,,2,17,1,primary,1,1,,,37.700001,1,146.5,1,,,,,,,,0,,0,,,17.565725
159,,Democratic Republic of the Congo,Equateur,Sud-Ubangi,1,,2,18,1,primary,1,1,,,55.900002,1,154.2,1,,,,,,,,0,,0,,,23.509483
160,,Democratic Republic of the Congo,Equateur,Sud-Ubangi,1,,2,16,2,secondary,1,1,,,36.299999,1,134.5,1,,,,,,,,0,,0,,,20.066057
161,,Democratic Republic of the Congo,Equateur,Sud-Ubangi,1,,2,20,1,primary,1,1,,,52,1,150.60001,1,22.927324,,2,,,,,0,,0,,,
162,,Democratic Republic of the Congo,Equateur,Sud-Ubangi,1,,2,19,1,primary,1,1,,,55.700001,1,160.89999,1,,,,,,,,0,,0,,,21.515089
163,,Democratic Republic of the Congo,Equateur,Sud-Ubangi,1,,2,19,1,primary,1,1,,,39.099998,1,147,1,,,,,,,,0,,0,,,18.094313
164,,Democratic Republic of the Congo,Equateur,Sud-Ubangi,1,,2,23,1,no formal schooling,1,1,,,44.299999,1,153,1,18.924345,,2,,,,,0,,0,,,
165,,Democratic Republic of the Congo,Equateur,Sud-Ubangi,1,,2,26,1,primary,1,1,,,46,1,149.3,1,20.636602,,2,,,,,0,,0,,,
166,,Democratic Republic of the Congo,Equateur,Sud-Ubangi,1,,2,28,1,no formal schooling,1,1,,,44.400002,1,152.2,1,19.166981,,2,,,,,0,,0,,,
167,,Democratic Republic of the Congo,Equateur,Sud-Ubangi,1,,2,18,2,secondary,1,1,,,,,156.5,1,,,,,,,,0,,0,,Missing value for weight,
168,,Democratic Republic of the Congo,Equateur,Sud-Ubangi,1,,2,21,1,primary,1,1,,,50.599998,1,159,1,20.01503,,2,,,,,0,,0,,,
169,,Democratic Republic of the Congo,Equateur,Sud-Ubangi,1,,2,19,1,no formal schooling,1,1,,,51.299999,1,161,1,,,,,,,,0,,0,,,19.790903
170,,Democratic Republic of the Congo,Equateur,Sud-Ubangi,1,,2,28,2,secondary,1,1,,,50.400002,1,156,1,20.71006,,2,,,,,0,,0,,,
171,,Democratic Republic of the Congo,Equateur,Sud-Ubangi,1,,2,20,2,secondary,1,1,,,55.299999,1,167,1,19.828606,,2,,,,,0,,0,,,
172,,Democratic Republic of the Congo,Equateur,Sud-Ubangi,1,,2,24,2,secondary,1,1,,,47.400002,1,159,1,18.749258,,2,,,,,0,,0,,,
173,,Democratic Republic of the Congo,Equateur,Sud-Ubangi,1,,2,23,1,primary,1,1,,,62.200001,1,168.5,1,21.907387,,2,,,,,0,,0,,,
174,,Democratic Republic of the Congo,Equateur,Sud-Ubangi,1,,2,32,1,primary,1,1,,,,,151.2,1,,,,,,,,0,,0,,Missing value for weight,
175,,Democratic Republic of the Congo,Equateur,Sud-Ubangi,1,,2,20,1,no formal schooling,1,1,,,41.599998,1,157.7,1,16.727457,,1,,,,,0,,0,,,
176,,Democratic Republic of the Congo,Equateur,Sud-Ubangi,1,,2,18,1,primary,1,1,,,51.099998,1,163,1,,,,,,,,0,,0,,,19.232941
177,,Democratic Republic of the Congo,Equateur,Sud-Ubangi,1,,2,17,1,primary,1,1,,,60.5,1,152.89999,1,,,,,,,,0,,0,,,25.87858
178,,Democratic Republic of the Congo,Equateur,Sud-Ubangi,1,,2,25,1,primary,1,1,,,51.5,1,154.10001,1,21.687122,,2,,,,,0,,0,,,
179,,Democratic Republic of the Congo,Equateur,Sud-Ubangi,1,,2,22,1,primary,1,1,,,55.599998,1,167,1,19.936174,,2,,,,,0,,0,,,
180,,Democratic Republic of the Congo,Equateur,Sud-Ubangi,1,,2,21,1,primary,1,1,,,48.5,1,146.2,1,22.690655,,2,,,,,0,,0,,,
181,,Democratic Republic of the Congo,Equateur,Sud-Ubangi,1,,2,31,1,primary,1,1,,,45.099998,1,152,1,19.52043,,2,,,,,0,,0,,,
182,,Democratic Republic of the Congo,Equateur,Sud-Ubangi,1,,2,25,1,primary,1,1,,,59.299999,1,150,1,26.355555,,3,,,,,0,,0,,,
183,,Democratic Republic of the Congo,Equateur,Sud-Ubangi,1,,2,27,1,no formal schooling,1,1,,,53.400002,1,152.5,1,22.961571,,2,,,,,0,,0,,,
184,,Democratic Republic of the Congo,Equateur,Sud-Ubangi,1,,2,33,2,secondary,1,1,,,65.300003,1,168,1,23.136339,,2,,,,,0,,0,,,
185,,Democratic Republic of the Congo,Equateur,Sud-Ubangi,1,,2,29,1,primary,1,1,,,62.299999,1,159,1,24.643013,,2,,,,,0,,0,,,