id,sex,age,recall_n,recall_d,recall_m,recall_y,weekday,respondent,us_intake,consum_h,consum_min,meal_type,meal_place,eat_seq,food_type,rcp_code,rcp_descr,rcp_descr_eng,foodex2_rcp_code,foodex2_rcp_descr,rcp_amount,ingr_code,ingr_descr,ingr_descr_eng,foodex2_ingr_code,foodex2_ingr_descr,ingr_amount_unproc,ingr_amount_proc,energy,totalpro,animalpro,dairypro,plantpro,carb,adsugar,fiber,totalfat,sfa,mufa,pufa,water,n6,seafood_n3,plant_n3,tfa,chol,ca,fe,na,k,mg,zn,iod,se,ph,cu,vitb1,vitb2,vitb3,vitb6,fol,vitb12,vitc,vita,bcarot,vitd,vite,vitk,note
1,2,34,1,,3,2015,,1,,,,2,,1,1,,,,,,,17,Café,,A03KA#F04.A03GN$F04.A03DL,"Coffee beverages, INGREDIENT = Coffee ground, roasted, INGREDIENT = Tap water",,170,2,.2,,,,0,,0,0,0,.029999999,.02,,,,,,,3,.17,,,,.029999999,,,,,.02,.14,,0,3,0,0,0,,,,,
1,2,34,1,,3,2015,,1,,,,2,,2,3,44,"Pondu, banane plantains, arachides crues",,,,290,10,Banane plantain mûre bouillie,,A01LE#F28.A07GL$F10.A07XL,"Plantains, PROCESS = Boiling, QUALITATIVE-INFO = Ripe / mature",,60.700001,81,.69999999,,,,18.5,,1.3,.1,.039999999,.0099999998,.02,,,,,,,4,.49000001,,,,.059999999,,,,,.029999999,.02,,.13,8,0,7.4000001,24,,,,,
1,2,34,1,,3,2015,,1,,,,2,,2,3,44,"Pondu, banane plantains, arachides crues",,,,290,29,Cube Maggi,,A043H#F28.A07KG$F26.A07XE,"Stock cube or granulate, beef, PROCESS = Drying (dehydration), GENERIC-TERM = Other",,.30000001,0,0,,,,0,,0,0,.0099999998,0,0,,,,,,,0,.0099999998,,,,0,,,,,0,0,,0,0,0,0,0,,,,,
1,2,34,1,,3,2015,,1,,,,2,,2,3,44,"Pondu, banane plantains, arachides crues",,,,290,84,Sel,,A042P,Salt,,1.1,0,0,,,,0,,0,0,0,0,0,,,,,,,2,.0099999998,,,,0,,,,,0,0,,0,0,0,0,0,,,,,
1,2,34,1,,3,2015,,1,,,,2,,2,3,44,"Pondu, banane plantains, arachides crues",,,,290,77,Poissons fumés,,A0EYS#F27.A029Q,"Smoked fish, SOURCE-COMMODITIES = Whitefishes or coregonus",,6.5999999,12,1.1,,,,0,,0,.80000001,.11,.36000001,.15000001,,,,,,,2,.029999999,,,,.02,,,,,0,.0099999998,,.02,0,.28,0,19,,,,,
1,2,34,1,,3,2015,,1,,,,2,,2,3,44,"Pondu, banane plantains, arachides crues",,,,290,42,Huile de Palme rouge,,A037N#F10.A0F2S,"Palm oil/fat, QUALITATIVE-INFO = Red",,17.700001,160,0,,,,0,,0,17.700001,8.75,6.5700002,1.65,,,,,,,0,0,,,,0,,,,,0,0,,0,0,0,0,1015,,,,,
1,2,34,1,,3,2015,,1,,,,2,,2,3,44,"Pondu, banane plantains, arachides crues",,,,290,25,Ciboulette  cuit à la vapeur,,A00XD#F28.A07GP,"Chives, PROCESS = Steaming",,5.5,2,.2,,,,.30000001,,.2,0,.0099999998,.0099999998,.02,,,,,,,6,.11,,,,.039999999,,,,,0,.0099999998,,.0099999998,6,0,3.3399999,14,,,,,
1,2,34,1,,3,2015,,1,,,,2,,2,3,44,"Pondu, banane plantains, arachides crues",,,,290,6,"Arachide, tout type, bouilli",,A015H#F28.A07GL,"Peanuts, PROCESS = Boiling",,16.1,34,1.5,,,,1,,.5,2.7,.41,1.45,.93000001,,,,,,,5,.27000001,,,,.19,,,,,.029999999,.0099999998,,.02,11,0,0,0,,,,,
1,2,34,1,,3,2015,,1,,,,2,,2,3,44,"Pondu, banane plantains, arachides crues",,,,290,80,Pondu (Feuilles de Manioc bouillies sans sel),,A00NJ#F28.A07GL$F10.A0CQE,"Cassava leaves, PROCESS = Boiling, QUALITATIVE-INFO = Without added salt",,86.099998,88,6.8000002,,,,11.7,,3.3,1.3,.25999999,.1,.52999997,,,,,,,238,3.79,,,,.46000001,,,,,.15000001,.27000001,,.18000001,53,0,13.77,233,,,,,
1,2,34,1,,3,2015,,1,,,,4,,1,1,,,,,,,4,"Ananas, pulpe, crue",,A01LP#F28.A07HS,"Pineapples, PROCESS = Raw, no heat treatment",,171,92,.69999999,,,,20.5,,2.2,.69999999,0,0,.17,,,,,,,34,.86000001,,,,.19,,,,,.12,.050000001,,.15000001,21,0,50.959999,9,,,,,
1,2,34,1,,3,2015,,1,,,,4,,2,3,32,Café  au sucre,,,,182,17,Café,,A03KA#F04.A03GN$F04.A03DL,"Coffee beverages, INGREDIENT = Coffee ground, roasted, INGREDIENT = Tap water",,7.0999999,0,0,,,,0,,0,0,0,0,0,,,,,,,0,.0099999998,,,,0,,,,,0,.0099999998,,0,0,0,0,0,,,,,
1,2,34,1,,3,2015,,1,,,,4,,2,3,32,Café  au sucre,,,,182,85,Sucre,,A032J,White sugar,,23.299999,93,0,,,,23.299999,,0,0,0,0,0,,,,,,,0,.02,,,,0,,,,,0,0,,0,0,0,0,0,,,,,
1,2,34,1,,3,2015,,1,,,,4,,3,3,44,"Pondu, banane plantains, arachides crues",,,,580,80,Pondu (Feuilles de Manioc bouillies sans sel),,A00NJ#F28.A07GL$F10.A0CQE,"Cassava leaves, PROCESS = Boiling, QUALITATIVE-INFO = Without added salt",,172.10001,176,13.6,,,,23.4,,6.5,2.5,.51999998,.20999999,1.05,,,,,,,475,7.5700002,,,,.93000001,,,,,.28999999,.52999997,,.36000001,107,0,27.540001,467,,,,,
1,2,34,1,,3,2015,,1,,,,4,,3,3,44,"Pondu, banane plantains, arachides crues",,,,580,77,Poissons fumés,,A0EYS#F27.A029Q,"Smoked fish, SOURCE-COMMODITIES = Whitefishes or coregonus",,13.2,23,2.2,,,,0,,0,1.6,.23,.72000003,.30000001,,,,,,,3,.059999999,,,,.039999999,,,,,.0099999998,.02,,.029999999,0,.56,0,37,,,,,
1,2,34,1,,3,2015,,1,,,,4,,3,3,44,"Pondu, banane plantains, arachides crues",,,,580,29,Cube Maggi,,A043H#F28.A07KG$F26.A07XE,"Stock cube or granulate, beef, PROCESS = Drying (dehydration), GENERIC-TERM = Other",,.5,1,.1,,,,.1,,0,0,.0099999998,.0099999998,0,,,,,,,0,.0099999998,,,,0,,,,,0,0,,0,0,.0099999998,0,0,,,,,
1,2,34,1,,3,2015,,1,,,,4,,3,3,44,"Pondu, banane plantains, arachides crues",,,,580,42,Huile de Palme rouge,,A037N#F10.A0F2S,"Palm oil/fat, QUALITATIVE-INFO = Red",,35.5,319,0,,,,0,,0,35.5,17.5,13.13,3.3,,,,,,,0,0,,,,0,,,,,0,0,,0,0,0,0,2030,,,,,
1,2,34,1,,3,2015,,1,,,,4,,3,3,44,"Pondu, banane plantains, arachides crues",,,,580,25,Ciboulette  cuit à la vapeur,,A00XD#F28.A07GP,"Chives, PROCESS = Steaming",,11.1,4,.40000001,,,,.60000002,,.30000001,.1,.02,.0099999998,.039999999,,,,,,,12,.22,,,,.079999998,,,,,.0099999998,.0099999998,,.02,12,0,6.6700001,28,,,,,
1,2,34,1,,3,2015,,1,,,,4,,3,3,44,"Pondu, banane plantains, arachides crues",,,,580,6,"Arachide, tout type, bouilli",,A015H#F28.A07GL,"Peanuts, PROCESS = Boiling",,32.200001,68,3.0999999,,,,1.9,,1,5.4000001,.81,2.9100001,1.85,,,,,,,11,.55000001,,,,.38999999,,,,,.059999999,.02,,.039999999,23,0,0,0,,,,,
1,2,34,1,,3,2015,,1,,,,4,,3,3,44,"Pondu, banane plantains, arachides crues",,,,580,84,Sel,,A042P,Salt,,2.3,0,0,,,,0,,0,0,0,0,0,,,,,,,5,.029999999,,,,0,,,,,0,0,,0,0,0,0,0,,,,,
1,2,34,1,,3,2015,,1,,,,4,,3,3,44,"Pondu, banane plantains, arachides crues",,,,580,10,Banane plantain mûre bouillie,,A01LE#F28.A07GL$F10.A07XL,"Plantains, PROCESS = Boiling, QUALITATIVE-INFO = Ripe / mature",,121.3,161,1.3,,,,37,,2.7,.2,.079999998,.02,.050000001,,,,,,,7,.97000003,,,,.12,,,,,.059999999,.050000001,,.25,16,0,14.8,47,,,,,
2,2,31,1,,4,2015,,1,,,,2,,2,1,,,,,,,61,Manioc racine grillé,,A00ZZ#F28.A0EJY,"Cassava roots, PROCESS = Grilling/griddling (high temperature cooking)",,91,147,1.1,,,,34.099998,,1.7,.30000001,.059999999,.059999999,.050000001,,,,,,,41,.67000002,,,,.33000001,,,,,.039999999,.050000001,,.079999998,18,0,21.549999,1,,,,,
2,2,31,1,,4,2015,,1,,,,2,,1,1,,,,,,,17,Café,,A03KA#F04.A03GN$F04.A03DL,"Coffee beverages, INGREDIENT = Coffee ground, roasted, INGREDIENT = Tap water",,312,3,.40000001,,,,0,,0,.1,0,.059999999,.029999999,,,,,,,6,.31,,,,.059999999,,,,,.029999999,.25,,0,6,0,0,0,,,,,
2,2,31,1,,4,2015,,1,,,,2,,3,3,4,Pondu avec arachides crues et huile de palme,,,,618,29,Cube Maggi,,A043H#F28.A07KG$F26.A07XE,"Stock cube or granulate, beef, PROCESS = Drying (dehydration), GENERIC-TERM = Other",,.60000002,1,.1,,,,.1,,0,0,.0099999998,.0099999998,0,,,,,,,0,.0099999998,,,,0,,,,,0,0,,0,0,.0099999998,0,0,,,,,
2,2,31,1,,4,2015,,1,,,,2,,3,3,4,Pondu avec arachides crues et huile de palme,,,,618,25,Ciboulette  cuit à la vapeur,,A00XD#F28.A07GP,"Chives, PROCESS = Steaming",,2.8,1,.1,,,,.2,,.1,0,.0099999998,0,.0099999998,,,,,,,3,.059999999,,,,.02,,,,,0,0,,0,3,0,1.71,7,,,,,
2,2,31,1,,4,2015,,1,,,,2,,3,3,4,Pondu avec arachides crues et huile de palme,,,,618,6,"Arachide, tout type, bouilli",,A015H#F28.A07GL,"Peanuts, PROCESS = Boiling",,20.4,43,1.9,,,,1.2,,.60000002,3.4000001,.51999998,1.84,1.17,,,,,,,7,.34999999,,,,.23999999,,,,,.039999999,.0099999998,,.02,15,0,0,0,,,,,
2,2,31,1,,4,2015,,1,,,,2,,3,3,4,Pondu avec arachides crues et huile de palme,,,,618,35,Feuilles de Manioc bouillies sans sel,,A00NJ#F28.A07GL$F10.A0CQE,"Cassava leaves, PROCESS = Boiling, QUALITATIVE-INFO = Without added salt",,202.8,207,16,,,,27.6,,7.6999998,3,.61000001,.23999999,1.24,,,,,,,560,8.9200001,,,,1.1,,,,,.34,.63,,.43000001,126,0,32.450001,550,,,,,
2,2,31,1,,4,2015,,1,,,,2,,3,3,4,Pondu avec arachides crues et huile de palme,,,,618,84,Sel,,A042P,Salt,,2.7,0,0,,,,0,,0,0,0,0,0,,,,,,,6,.029999999,,,,0,,,,,0,0,,0,0,0,0,0,,,,,
2,2,31,1,,4,2015,,1,,,,2,,3,3,4,Pondu avec arachides crues et huile de palme,,,,618,42,Huile de Palme rouge,,A037N#F10.A0F2S,"Palm oil/fat, QUALITATIVE-INFO = Red",,72.099998,649,0,,,,0,,0,72.099998,35.560001,26.68,6.71,,,,,,,0,.0099999998,,,,0,,,,,0,0,,0,0,0,0,4125,,,,,
2,2,31,1,,4,2015,,1,,,,4,,1,1,,,,,,,10,Banane plantain mûre bouillie,,A01LE#F28.A07GL$F10.A07XL,"Plantains, PROCESS = Boiling, QUALITATIVE-INFO = Ripe / mature",,432,575,4.8000002,,,,131.8,,9.5,.80000001,.30000001,.090000004,.17,,,,,,,26,3.46,,,,.43000001,,,,,.22,.17,,.91000003,56,0,52.700001,168,,,,,
2,2,31,1,,4,2015,,1,,,,4,,2,3,4,Pondu avec arachides crues et huile de palme,,,,206,84,Sel,,A042P,Salt,,.89999998,0,0,,,,0,,0,0,0,0,0,,,,,,,2,.0099999998,,,,0,,,,,0,0,,0,0,0,0,0,,,,,
2,2,31,1,,4,2015,,1,,,,4,,2,3,4,Pondu avec arachides crues et huile de palme,,,,206,35,Feuilles de Manioc bouillies sans sel,,A00NJ#F28.A07GL$F10.A0CQE,"Cassava leaves, PROCESS = Boiling, QUALITATIVE-INFO = Without added salt",,67.599998,69,5.3000002,,,,9.1999998,,2.5999999,1,.2,.079999998,.41,,,,,,,187,2.97,,,,.37,,,,,.11,.20999999,,.14,42,0,10.82,183,,,,,
2,2,31,1,,4,2015,,1,,,,4,,2,3,4,Pondu avec arachides crues et huile de palme,,,,206,29,Cube Maggi,,A043H#F28.A07KG$F26.A07XE,"Stock cube or granulate, beef, PROCESS = Drying (dehydration), GENERIC-TERM = Other",,.2,0,0,,,,0,,0,0,0,0,0,,,,,,,0,0,,,,0,,,,,0,0,,0,0,0,0,0,,,,,
2,2,31,1,,4,2015,,1,,,,4,,2,3,4,Pondu avec arachides crues et huile de palme,,,,206,25,Ciboulette  cuit à la vapeur,,A00XD#F28.A07GP,"Chives, PROCESS = Steaming",,.89999998,0,0,,,,.1,,0,0,0,0,0,,,,,,,1,.02,,,,.0099999998,,,,,0,0,,0,1,0,.56999999,2,,,,,
2,2,31,1,,4,2015,,1,,,,4,,2,3,4,Pondu avec arachides crues et huile de palme,,,,206,42,Huile de Palme rouge,,A037N#F10.A0F2S,"Palm oil/fat, QUALITATIVE-INFO = Red",,24,216,0,,,,0,,0,24,11.85,8.8900003,2.24,,,,,,,0,0,,,,0,,,,,0,0,,0,0,0,0,1375,,,,,
2,2,31,1,,4,2015,,1,,,,4,,2,3,4,Pondu avec arachides crues et huile de palme,,,,206,6,"Arachide, tout type, bouilli",,A015H#F28.A07GL,"Peanuts, PROCESS = Boiling",,6.8000002,14,.60000002,,,,.40000001,,.2,1.1,.17,.61000001,.38999999,,,,,,,2,.12,,,,.079999998,,,,,.0099999998,0,,.0099999998,5,0,0,0,,,,,
2,2,31,1,,4,2015,,1,,,,,,1,1,,,,,,,79,Pomme rouge,,A01DJ#F10.A0F2S,"Apples, QUALITATIVE-INFO = Red",,80,42,.2,,,,11,,1.9,.1,.02,.0099999998,.039999999,,,,,,,5,.1,,,,.029999999,,,,,.02,.02,,.029999999,2,0,3.6800001,2,,,,,
2,2,31,2,,5,2015,,1,,,,2,,3,1,,,,,,,37,Fuku (Maîs fermenté),,A0ESM#F04.A000T$F10.A0CJP,"Porridge water based (ready to eat), INGREDIENT = Maize grain, QUALITATIVE-INFO = Hard",,412,536,11.5,,,,117,,5.4000001,5.9000001,.81999999,1.52,2.6800001,,,,,,,12,.41,,,,.57999998,,,,,.079999998,.039999999,,.12,4,0,0,12,,,,,
2,2,31,2,,5,2015,,1,,,,2,,1,1,,,,,,,17,Café,,A03KA#F04.A03GN$F04.A03DL,"Coffee beverages, INGREDIENT = Coffee ground, roasted, INGREDIENT = Tap water",,270,3,.30000001,,,,0,,0,.1,0,.050000001,.029999999,,,,,,,5,.27000001,,,,.050000001,,,,,.029999999,.22,,0,5,0,0,0,,,,,
2,2,31,2,,5,2015,,1,,,,2,,2,3,11,Feuille de manioc simple,,,,412,29,Cube Maggi,,A043H#F28.A07KG$F26.A07XE,"Stock cube or granulate, beef, PROCESS = Drying (dehydration), GENERIC-TERM = Other",,.2,0,0,,,,0,,0,0,0,0,0,,,,,,,0,.0099999998,,,,0,,,,,0,0,,0,0,0,0,0,,,,,
2,2,31,2,,5,2015,,1,,,,2,,2,3,11,Feuille de manioc simple,,,,412,35,Feuilles de Manioc bouillies sans sel,,A00NJ#F28.A07GL$F10.A0CQE,"Cassava leaves, PROCESS = Boiling, QUALITATIVE-INFO = Without added salt",,106.2,108,8.3999996,,,,14.4,,4,1.6,.31999999,.13,.64999998,,,,,,,293,4.6700001,,,,.56999999,,,,,.18000001,.33000001,,.22,66,0,16.99,288,,,,,
2,2,31,2,,5,2015,,1,,,,2,,2,3,11,Feuille de manioc simple,,,,412,25,Ciboulette  cuit à la vapeur,,A00XD#F28.A07GP,"Chives, PROCESS = Steaming",,1.6,1,.1,,,,.1,,0,0,0,0,.0099999998,,,,,,,2,.029999999,,,,.0099999998,,,,,0,0,,0,2,0,.97000003,4,,,,,
2,2,31,2,,5,2015,,1,,,,2,,2,3,11,Feuille de manioc simple,,,,412,84,Sel,,A042P,Salt,,1.6,0,0,,,,0,,0,0,0,0,0,,,,,,,3,.02,,,,0,,,,,0,0,,0,0,0,0,0,,,,,
2,2,31,2,,5,2015,,1,,,,2,,2,3,11,Feuille de manioc simple,,,,412,42,Huile de Palme rouge,,A037N#F10.A0F2S,"Palm oil/fat, QUALITATIVE-INFO = Red",,51.400002,463,0,,,,0,,0,51.400002,25.35,19.02,4.7800002,,,,,,,0,.0099999998,,,,0,,,,,0,0,,0,0,0,0,2941,,,,,
2,2,31,2,,5,2015,,1,,,,4,,1,1,,,,,,,37,Fuku (Maîs fermenté),,A0ESM#F04.A000T$F10.A0CJP,"Porridge water based (ready to eat), INGREDIENT = Maize grain, QUALITATIVE-INFO = Hard",,760,988,21.299999,,,,215.8,,9.8999996,10.8,1.52,2.8099999,4.9400001,,,,,,,23,.75999999,,,,1.0599999,,,,,.15000001,.079999998,,.23,8,0,0,23,,,,,
2,2,31,2,,5,2015,,1,,,,4,,2,3,80,Poissons fumes avec huile de palme,,,,140,29,Cube Maggi,,A043H#F28.A07KG$F26.A07XE,"Stock cube or granulate, beef, PROCESS = Drying (dehydration), GENERIC-TERM = Other",,.40000001,1,.1,,,,.1,,0,0,.0099999998,.0099999998,0,,,,,,,0,.0099999998,,,,0,,,,,0,0,,0,0,0,0,0,,,,,
2,2,31,2,,5,2015,,1,,,,4,,2,3,80,Poissons fumes avec huile de palme,,,,140,42,Huile de Palme rouge,,A037N#F10.A0F2S,"Palm oil/fat, QUALITATIVE-INFO = Red",,5.5999999,51,0,,,,0,,0,5.5999999,2.78,2.0899999,.51999998,,,,,,,0,0,,,,0,,,,,0,0,,0,0,0,0,323,,,,,
2,2,31,2,,5,2015,,1,,,,4,,2,3,80,Poissons fumes avec huile de palme,,,,140,84,Sel,,A042P,Salt,,.80000001,0,0,,,,0,,0,0,0,0,0,,,,,,,2,.0099999998,,,,0,,,,,0,0,,0,0,0,0,0,,,,,
2,2,31,2,,5,2015,,1,,,,4,,2,3,80,Poissons fumes avec huile de palme,,,,140,90,"Tomate rouge, mûre frite",,A0DMX#F28.A07GR$F10.A0F2S$F10.A07XL,"Tomatoes, PROCESS = Frying, QUALITATIVE-INFO = Red, QUALITATIVE-INFO = Ripe / mature",,20.700001,5,.2,,,,.80000001,,.30000001,.1,.0099999998,.0099999998,.02,,,,,,,3,.14,,,,.17,,,,,.0099999998,.0099999998,,.02,3,0,6.6100001,11,,,,,
2,2,31,2,,5,2015,,1,,,,4,,2,3,80,Poissons fumes avec huile de palme,,,,140,88,Tomate en boîte,,A0DMX#F03.A06JF,"Tomatoes, PHYSICAL-STATE = Paste",,1.3,1,.1,,,,.2,,.1,0,0,0,0,,,,,,,0,.039999999,,,,.0099999998,,,,,0,0,,0,0,0,.28,1,,,,,
2,2,31,2,,5,2015,,1,,,,4,,2,3,80,Poissons fumes avec huile de palme,,,,140,77,Poissons fumés,,A0EYS#F27.A029Q,"Smoked fish, SOURCE-COMMODITIES = Whitefishes or coregonus",,51.099998,90,8.3999996,,,,0,,0,6.0999999,.88999999,2.8,1.16,,,,,,,13,.25,,,,.15000001,,,,,.029999999,.079999998,,.13,1,2.1800001,0,144,,,,,
2,2,31,2,,5,2015,,1,,,,4,,2,3,80,Poissons fumes avec huile de palme,,,,140,25,Ciboulette  cuit à la vapeur,,A00XD#F28.A07GP,"Chives, PROCESS = Steaming",,9.3999996,3,.40000001,,,,.5,,.30000001,.1,.02,.0099999998,.029999999,,,,,,,10,.18000001,,,,.059999999,,,,,.0099999998,.0099999998,,.0099999998,10,0,5.6300001,24,,,,,
2,2,31,2,,5,2015,,1,,,,6,,2,1,,,,,,,37,Fuku (Maîs fermenté),,A0ESM#F04.A000T$F10.A0CJP,"Porridge water based (ready to eat), INGREDIENT = Maize grain, QUALITATIVE-INFO = Hard",,650,845,18.200001,,,,184.60001,,8.3999996,9.1999998,1.3,2.4000001,4.2199998,,,,,,,20,.64999998,,,,.91000003,,,,,.13,.059999999,,.2,6,0,0,20,,,,,
2,2,31,2,,5,2015,,1,,,,6,,1,3,11,Feuille de manioc simple,,,,206,25,Ciboulette  cuit à la vapeur,,A00XD#F28.A07GP,"Chives, PROCESS = Steaming",,.80000001,0,0,,,,0,,0,0,0,0,0,,,,,,,1,.02,,,,.0099999998,,,,,0,0,,0,1,0,.47999999,2,,,,,
2,2,31,2,,5,2015,,1,,,,6,,1,3,11,Feuille de manioc simple,,,,206,42,Huile de Palme rouge,,A037N#F10.A0F2S,"Palm oil/fat, QUALITATIVE-INFO = Red",,25.700001,231,0,,,,0,,0,25.700001,12.67,9.5100002,2.3900001,,,,,,,0,0,,,,0,,,,,0,0,,0,0,0,0,1471,,,,,
2,2,31,2,,5,2015,,1,,,,6,,1,3,11,Feuille de manioc simple,,,,206,35,Feuilles de Manioc bouillies sans sel,,A00NJ#F28.A07GL$F10.A0CQE,"Cassava leaves, PROCESS = Boiling, QUALITATIVE-INFO = Without added salt",,53.099998,54,4.1999998,,,,7.1999998,,2,.80000001,.16,.059999999,.31999999,,,,,,,147,2.3399999,,,,.28999999,,,,,.090000004,.16,,.11,33,0,8.4899998,144,,,,,
2,2,31,2,,5,2015,,1,,,,6,,1,3,11,Feuille de manioc simple,,,,206,29,Cube Maggi,,A043H#F28.A07KG$F26.A07XE,"Stock cube or granulate, beef, PROCESS = Drying (dehydration), GENERIC-TERM = Other",,.1,0,0,,,,0,,0,0,0,0,0,,,,,,,0,0,,,,0,,,,,0,0,,0,0,0,0,0,,,,,
2,2,31,2,,5,2015,,1,,,,6,,1,3,11,Feuille de manioc simple,,,,206,84,Sel,,A042P,Salt,,.80000001,0,0,,,,0,,0,0,0,0,0,,,,,,,2,.0099999998,,,,0,,,,,0,0,,0,0,0,0,0,,,,,
2,2,31,2,,5,2015,,1,,,,,,1,1,,,,,,,9,"Avocat, pulpe, cru/Safou",,A01LB#F28.A07HS,"Avocados, PROCESS = Raw, no heat treatment",,127,196,2.2,,,,1.8,,6,16.299999,2.3699999,10.92,2.02,,,,,,,19,1.02,,,,.64999998,,,,,.079999998,.19,,.44,44,0,17.780001,8,,,,,
3,2,21,1,,12,2015,,1,,,,2,,2,1,,,,,,,17,Café,,A03KA#F04.A03GN$F04.A03DL,"Coffee beverages, INGREDIENT = Coffee ground, roasted, INGREDIENT = Tap water",,166,2,.2,,,,0,,0,0,0,.029999999,.02,,,,,,,3,.17,,,,.029999999,,,,,.02,.13,,0,3,0,0,0,,,,,
3,2,21,1,,12,2015,,1,,,,2,,1,1,,,,,,,10,Banane plantain mûre bouillie,,A01LE#F28.A07GL$F10.A07XL,"Plantains, PROCESS = Boiling, QUALITATIVE-INFO = Ripe / mature",,76,101,.80000001,,,,23.200001,,1.7,.1,.050000001,.02,.029999999,,,,,,,5,.61000001,,,,.079999998,,,,,.039999999,.029999999,,.16,10,0,9.2700005,30,,,,,
3,2,21,1,,12,2015,,1,,,,4,,2,1,,,,,,,37,Fuku (Maîs fermenté),,A0ESM#F04.A000T$F10.A0CJP,"Porridge water based (ready to eat), INGREDIENT = Maize grain, QUALITATIVE-INFO = Hard",,260,338,7.3000002,,,,73.800003,,3.4000001,3.7,.51999998,.95999998,1.6900001,,,,,,,8,.25999999,,,,.36000001,,,,,.050000001,.029999999,,.079999998,3,0,0,8,,,,,
3,2,21,1,,12,2015,,1,,,,4,,1,3,11,Feuille de manioc simple,,,,137,42,Huile de Palme rouge,,A037N#F10.A0F2S,"Palm oil/fat, QUALITATIVE-INFO = Red",,17.1,154,0,,,,0,,0,17.1,8.4300003,6.3299999,1.59,,,,,,,0,0,,,,0,,,,,0,0,,0,0,0,0,978,,,,,
3,2,21,1,,12,2015,,1,,,,4,,1,3,11,Feuille de manioc simple,,,,137,25,Ciboulette  cuit à la vapeur,,A00XD#F28.A07GP,"Chives, PROCESS = Steaming",,.5,0,0,,,,0,,0,0,0,0,0,,,,,,,1,.0099999998,,,,0,,,,,0,0,,0,1,0,.31999999,1,,,,,
3,2,21,1,,12,2015,,1,,,,4,,1,3,11,Feuille de manioc simple,,,,137,29,Cube Maggi,,A043H#F28.A07KG$F26.A07XE,"Stock cube or granulate, beef, PROCESS = Drying (dehydration), GENERIC-TERM = Other",,.1,0,0,,,,0,,0,0,0,0,0,,,,,,,0,0,,,,0,,,,,0,0,,0,0,0,0,0,,,,,
3,2,21,1,,12,2015,,1,,,,4,,1,3,11,Feuille de manioc simple,,,,137,84,Sel,,A042P,Salt,,.5,0,0,,,,0,,0,0,0,0,0,,,,,,,1,.0099999998,,,,0,,,,,0,0,,0,0,0,0,0,,,,,
3,2,21,1,,12,2015,,1,,,,4,,1,3,11,Feuille de manioc simple,,,,137,35,Feuilles de Manioc bouillies sans sel,,A00NJ#F28.A07GL$F10.A0CQE,"Cassava leaves, PROCESS = Boiling, QUALITATIVE-INFO = Without added salt",,35.299999,36,2.8,,,,4.8000002,,1.3,.5,.11,.039999999,.22,,,,,,,97,1.55,,,,.19,,,,,.059999999,.11,,.07,22,0,5.6500001,96,,,,,
4,2,27,1,,12,2014,,1,,,,2,,1,1,,,,,,,71,"Pain, fait maison",,A004Y,"Wheat bread and rolls, white (refined flour)",,92,229,7.6999998,,,,44.5,,2.9000001,3.0999999,.63999999,.55000001,1.47,,,,,,,26,1.1,,,,.55000001,,,,,.15000001,.050000001,,.059999999,27,0,0,0,,,,,
4,2,27,1,,12,2014,,1,,,,2,,2,3,65,Thé sucré,,,,215,87,Thé,,A03LC#F04.A03DL$F10.A166Z,"Fermented tea infusion, INGREDIENT = Tap water, QUALITATIVE-INFO = Black",,3.5,0,0,,,,0,,0,0,0,0,0,,,,,,,0,0,,,,0,,,,,0,0,,0,0,0,0,0,,,,,
4,2,27,1,,12,2014,,1,,,,2,,2,3,65,Thé sucré,,,,215,85,Sucre,,A032J,White sugar,,53.400002,214,0,,,,53.299999,,0,0,0,0,0,,,,,,,1,.050000001,,,,.0099999998,,,,,0,.0099999998,,0,0,0,0,0,,,,,
4,2,27,1,,12,2014,,1,,,,4,,1,3,97,Amarantes avec arachides crues et huile de palme,,,,681,89,"Tomate rouge, mûre bouillie",,A0DMX#F28.A07GL$F10.A07XL$F10.A0CQE$F10.A0F2S,"Tomatoes, PROCESS = Boiling, QUALITATIVE-INFO = Ripe / mature, QUALITATIVE-INFO = Without added salt, QUALITATIVE-INFO = Red",,25.6,7,.30000001,,,,1.1,,.5,0,.0099999998,.0099999998,.02,,,,,,,4,.15000001,,,,.19,,,,,.0099999998,.0099999998,,.02,4,0,5.9400001,16,,,,,
4,2,27,1,,12,2014,,1,,,,4,,1,3,97,Amarantes avec arachides crues et huile de palme,,,,681,84,Sel,,A042P,Salt,,9.1999998,0,0,,,,0,,0,0,0,0,0,,,,,,,20,.11,,,,.0099999998,,,,,0,0,,0,0,0,0,0,,,,,
4,2,27,1,,12,2014,,1,,,,4,,1,3,97,Amarantes avec arachides crues et huile de palme,,,,681,42,Huile de Palme rouge,,A037N#F10.A0F2S,"Palm oil/fat, QUALITATIVE-INFO = Red",,71.800003,647,0,,,,0,,0,71.800003,35.419998,26.58,6.6799998,,,,,,,0,.0099999998,,,,0,,,,,0,0,,0,0,0,0,4110,,,,,
4,2,27,1,,12,2014,,1,,,,4,,1,3,97,Amarantes avec arachides crues et huile de palme,,,,681,3,"Amarante/fumbwa, feuilles bouillies sans sel",,A00ML#F28.A07GL$F10.A0CQE,"Amaranth leaves, PROCESS = Boiling, QUALITATIVE-INFO = Without added salt",,276.89999,114,12.7,,,,13.3,,4.1999998,.69999999,.22,.17,.33000001,,,,,,,1052,13.57,,,,1.58,,,,,.079999998,.63999999,,.36000001,116,0,52.610001,631,,,,,
4,2,27,1,,12,2014,,1,,,,4,,1,3,97,Amarantes avec arachides crues et huile de palme,,,,681,6,"Arachide, tout type, bouilli",,A015H#F28.A07GL,"Peanuts, PROCESS = Boiling",,77,162,7.4000001,,,,4.5999999,,2.4000001,12.9,1.95,6.96,4.4299998,,,,,,,26,1.3099999,,,,.92000002,,,,,.15000001,.039999999,,.090000004,55,0,0,0,,,,,
4,2,27,1,,12,2014,,1,,,,4,,1,3,97,Amarantes avec arachides crues et huile de palme,,,,681,29,Cube Maggi,,A043H#F28.A07KG$F26.A07XE,"Stock cube or granulate, beef, PROCESS = Drying (dehydration), GENERIC-TERM = Other",,.89999998,2,.2,,,,.1,,0,0,.02,.0099999998,0,,,,,,,1,.02,,,,0,,,,,0,0,,0,0,.0099999998,0,0,,,,,
4,2,27,1,,12,2014,,1,,,,4,,1,3,97,Amarantes avec arachides crues et huile de palme,,,,681,25,Ciboulette  cuit à la vapeur,,A00XD#F28.A07GP,"Chives, PROCESS = Steaming",,24,9,1,,,,1.3,,.69999999,.2,.039999999,.029999999,.079999998,,,,,,,27,.47,,,,.16,,,,,.02,.029999999,,.039999999,26,0,14.48,61,,,,,
4,2,27,1,,12,2014,,1,,,,6,,1,1,,,,,,,37,Fuku (Maîs fermenté),,A0ESM#F04.A000T$F10.A0CJP,"Porridge water based (ready to eat), INGREDIENT = Maize grain, QUALITATIVE-INFO = Hard",,365,474,10.2,,,,103.7,,4.6999998,5.1999998,.73000002,1.35,2.3699999,,,,,,,11,.36000001,,,,.50999999,,,,,.07,.039999999,,.11,4,0,0,11,,,,,
4,2,27,1,,12,2014,,1,,,,6,,2,3,4,Pondu avec arachides crues et huile de palme,,,,206,42,Huile de Palme rouge,,A037N#F10.A0F2S,"Palm oil/fat, QUALITATIVE-INFO = Red",,24,216,0,,,,0,,0,24,11.85,8.8900003,2.24,,,,,,,0,0,,,,0,,,,,0,0,,0,0,0,0,1375,,,,,
4,2,27,1,,12,2014,,1,,,,6,,2,3,4,Pondu avec arachides crues et huile de palme,,,,206,25,Ciboulette  cuit à la vapeur,,A00XD#F28.A07GP,"Chives, PROCESS = Steaming",,.89999998,0,0,,,,.1,,0,0,0,0,0,,,,,,,1,.02,,,,.0099999998,,,,,0,0,,0,1,0,.56999999,2,,,,,
4,2,27,1,,12,2014,,1,,,,6,,2,3,4,Pondu avec arachides crues et huile de palme,,,,206,35,Feuilles de Manioc bouillies sans sel,,A00NJ#F28.A07GL$F10.A0CQE,"Cassava leaves, PROCESS = Boiling, QUALITATIVE-INFO = Without added salt",,67.599998,69,5.3000002,,,,9.1999998,,2.5999999,1,.2,.079999998,.41,,,,,,,187,2.97,,,,.37,,,,,.11,.20999999,,.14,42,0,10.82,183,,,,,
4,2,27,1,,12,2014,,1,,,,6,,2,3,4,Pondu avec arachides crues et huile de palme,,,,206,29,Cube Maggi,,A043H#F28.A07KG$F26.A07XE,"Stock cube or granulate, beef, PROCESS = Drying (dehydration), GENERIC-TERM = Other",,.2,0,0,,,,0,,0,0,0,0,0,,,,,,,0,0,,,,0,,,,,0,0,,0,0,0,0,0,,,,,
4,2,27,1,,12,2014,,1,,,,6,,2,3,4,Pondu avec arachides crues et huile de palme,,,,206,84,Sel,,A042P,Salt,,.89999998,0,0,,,,0,,0,0,0,0,0,,,,,,,2,.0099999998,,,,0,,,,,0,0,,0,0,0,0,0,,,,,
4,2,27,1,,12,2014,,1,,,,6,,2,3,4,Pondu avec arachides crues et huile de palme,,,,206,6,"Arachide, tout type, bouilli",,A015H#F28.A07GL,"Peanuts, PROCESS = Boiling",,6.8000002,14,.60000002,,,,.40000001,,.2,1.1,.17,.61000001,.38999999,,,,,,,2,.12,,,,.079999998,,,,,.0099999998,0,,.0099999998,5,0,0,0,,,,,
4,2,27,1,,12,2014,,1,,,,,,1,1,,,,,,,57,"Mangue, pulpe orange foncée crue",,A01LF#F28.A07HS$F10.A0F5J,"Mangoes, PROCESS = Raw, no heat treatment, QUALITATIVE-INFO = Orange",,1025,779,4.0999999,,,,177.3,,21.5,4.8000002,1.13,1.74,.92000002,,,,,,,123,7.1700001,,,,1.02,,,,,.92000002,.31,,1.33,297,0,671.38,4028,,,,,