id,hh_id,country,sec_area,tert_area,round,smpl_weight,sex,age,edc_level,edc,residence,preg_lact,breastfeeding,hh_head,wgt,wgt_method,hgt,hgt_method,bmi_adults,bmi_children,bmi_cat,misrep,pa,pa_cat,smok,special_diet,special_diet_other,clin_diet,clin_diet_other,note,bmi_chld,bmi_chld_zscore
1-01-01-0-01-126,,Portugal,5,,1,0,2,.95,2,,2,0,0,,7,1,71,1,,,2,,,,,,,,,,13.886134,-1.24
1-01-01-0-02-094,,Portugal,5,,1,1217.1200287279,2,1.11,3,,2,0,0,,10,1,76,1,,,2,,,,,,,,,,17.313019,.42
1-01-01-0-02-107,,Portugal,5,,1,1217.1200287279,2,1.23,2,,2,0,0,,10,1,76,1,,,3,,,,,,,,,,17.313019,1.09
1-01-01-0-03-044,,Portugal,5,,1,1627.5374055853,2,7,2,,2,0,,,26,1,125,1,,,2,,,,,,,,,,16.639999,.6
1-01-01-0-03-047,,Portugal,5,,1,1627.5374055853,2,3,2,,2,0,0,,15,1,98,1,,,2,,,,,,,,,,15.618492,.46
1-01-01-0-03-062,,Portugal,5,,1,1627.5374055853,2,3,3,,2,0,0,,12,1,94,1,,,2,,,,,,,,,,13.580806,-.98
1-01-01-0-04-043,,Portugal,5,,1,0,2,13,1,,2,0,,,57,1,164,1,,,2,,,,,,,,,,21.192743,.78
1-01-01-0-04-114,,Portugal,5,,1,4179.5384763469,2,16,1,,2,0,,,63,1,158,1,,,3,1,,1,1,,,,,,25.23634,1.23
1-01-01-0-05-049,,Portugal,5,,1,0,2,26,3,,2,0,,,61,1,162,1,23.243408,,2,,,2,2,,,,,,,
1-01-01-0-05-054,,Portugal,5,,1,2912.5909618328,2,20,2,,2,0,,,81,1,156,1,33.284023,,4,1,,3,2,,,,,,,
1-01-01-0-05-081,,Portugal,5,,1,2912.5909618328,2,23,3,,2,0,,,49,1,157,1,19.879103,,2,2,,3,3,,,,,,,
1-01-01-0-05-088,,Portugal,5,,1,2912.5909618328,2,22,2,,2,0,,,72,1,157,1,29.21011,,3,2,,3,3,,,,,,,
1-01-01-0-05-125,,Portugal,5,,1,2912.5909618328,2,22,3,,2,0,,,47,1,158,1,18.82711,,2,2,,2,3,,,,,,,
1-01-01-0-06-008,,Portugal,5,,1,2854.8467497599,2,41,2,,2,0,,,78,1,163,1,29.357521,,3,1,,2,1,,,,,,,
1-01-01-0-06-050,,Portugal,5,,1,2854.8467497599,2,58,1,,2,0,,,72,1,157,1,29.21011,,3,,,2,3,,,,,,,
1-01-01-0-06-086,,Portugal,5,,1,0,2,54,1,,2,0,,,74,1,164,1,27.513386,,3,,,2,3,,,,,,,
1-01-01-0-06-093,,Portugal,5,,1,2854.8467497599,2,63,3,,2,0,,,68,1,151,1,29.823254,,3,2,,3,3,,,,,,,
1-01-01-0-06-108,,Portugal,5,,1,0,2,38,2,,2,0,,,60,1,156,1,24.654833,,2,,,3,3,,,,,,,
1-01-01-0-06-109,,Portugal,5,,1,2854.8467497599,2,40,2,,2,0,,,55,1,154,1,23.191095,,2,2,,1,2,,,,,,,
1-01-01-0-06-124,,Portugal,5,,1,2854.8467497599,2,42,2,,2,0,,,57,1,145,1,27.110582,,3,1,,1,3,,,,,,,
1-01-01-0-06-136,,Portugal,5,,1,2854.8467497599,2,54,3,,2,0,,,81,1,159,1,32.039871,,4,1,,1,3,,,,,,,
1-01-01-0-07-065,,Portugal,5,,1,8175.9377711943,2,65,1,,2,0,,,80,1,144,1,38.580246,,4,1,,2,3,,,,,,,
1-01-01-0-07-095,,Portugal,5,,1,8175.9377711943,2,71,1,,2,0,,,56,1,149,1,25.224089,,3,2,,2,3,,,,,,,
1-01-01-0-08-076,,Portugal,5,,1,0,2,81,1,,2,0,,,58,1,142,1,28.764133,,3,,,2,3,,,,,,,
1-01-01-0-11-053,,Portugal,5,,1,0,1,.9,2,,2,,0,,9,1,73,1,,,2,,,,,,,,,,16.888721,.5
1-01-01-0-12-046,,Portugal,5,,1,0,1,1.56,3,,2,,3,,12,1,84,1,,,2,,,,,,,,,,17.006804,.45
1-01-01-0-12-121,,Portugal,5,,1,275.2135791965,1,1.5,2,,2,,0,,12,1,83,1,,,2,,,,,,,,,,17.419073,.4
1-01-01-0-13-059,,Portugal,5,,1,4640.9574468085,1,5,3,,2,,0,,22,1,118,1,,,2,,,,,,,,,,15.800057,.58
1-01-01-0-14-025,,Portugal,5,,1,4892.0615360577,1,10,3,,2,,,,30,1,137,1,,,2,,,,,,,,,,15.983803,-.35
1-01-01-0-14-137,,Portugal,5,,1,4892.0615360577,1,12,1,,2,,,,57,1,156,1,,,3,,,,,,,,,,23.422091,1.74
1-01-01-0-16-016,,Portugal,5,,1,1913.425697932,1,47,1,,2,,,,96,1,172,1,32.449974,,4,2,,3,2,,,,,,,
1-01-01-0-16-034,,Portugal,5,,1,1913.425697932,1,53,2,,2,,,,74,1,172,1,25.013521,,3,1,,3,3,,,,,,,
1-01-01-0-16-035,,Portugal,5,,1,1913.425697932,1,58,2,,2,,,,100,1,167,1,35.85643,,4,1,,,2,,,,,,,
1-01-01-0-16-036,,Portugal,5,,1,1913.425697932,1,48,1,,2,,,,66,1,171,1,22.571047,,2,2,,,1,,,,,,,
1-01-01-0-16-040,,Portugal,5,,1,1913.425697932,1,60,3,,2,,,,95,1,178,1,29.983587,,3,2,,2,2,,,,,,,
1-01-01-0-16-075,,Portugal,5,,1,1913.425697932,1,53,2,,2,,,,81,1,176,1,26.149277,,3,2,,1,3,,,,,,,
1-01-01-0-17-096,,Portugal,5,,1,5044.9003057799,1,71,1,,2,,,,85,1,168,1,30.116213,,4,2,,2,2,,,,,,,
1-01-01-0-18-089,,Portugal,5,,1,5044.9003057799,1,82,1,,2,,,,63,1,155,1,26.222685,,3,2,,1,2,,,,,,,
1-01-01-1-05-050,,Portugal,5,,1,0,2,23,2,,2,0,,,66,1,163,1,24.840981,,2,,,3,1,,,,,,,
1-01-01-1-05-075,,Portugal,5,,1,2912.5909618328,2,18,2,,2,0,,,54,1,159,1,,,2,2,,1,1,,,,,,21.359915,-.01
1-01-01-1-05-076,,Portugal,5,,1,0,2,24,3,,2,0,,,66,1,163,1,24.840981,,2,,,,1,,,,,,,
1-01-01-1-05-106,,Portugal,5,,1,2912.5909618328,2,24,2,,2,0,,,69,1,158,1,27.639801,,3,2,,1,2,,,,,,,
1-01-01-1-06-010,,Portugal,5,,1,2854.8467497599,2,37,1,,2,0,,,53,1,158,1,21.230572,,2,2,,1,3,,,,,,,
1-01-01-1-06-035,,Portugal,5,,1,2854.8467497599,2,44,2,,2,0,,,72,1,155,1,29.968782,,3,2,,1,3,,,,,,,
1-01-01-1-06-067,,Portugal,5,,1,2854.8467497599,2,48,2,,2,0,,,94,1,156,1,38.625904,,4,1,,3,3,,,,,,,
1-01-01-1-06-089,,Portugal,5,,1,2854.8467497599,2,46,1,,2,0,,,76,1,158,1,30.44384,,4,1,,2,3,,,,,,,
1-01-01-1-06-098,,Portugal,5,,1,2854.8467497599,2,48,2,,2,0,,,54,1,144,1,26.041666,,3,2,,1,3,,,,,,,
1-01-01-1-06-119,,Portugal,5,,1,2854.8467497599,2,37,2,,2,0,,,95,1,159,1,37.577629,,4,2,,3,1,,,,,,,
1-01-01-1-07-027,,Portugal,5,,1,8175.9377711943,2,71,1,,2,0,,,68,1,161,1,26.233557,,3,2,,2,3,,,,,,,
1-01-01-1-07-114,,Portugal,5,,1,8175.9377711943,2,72,1,,2,0,,,71,1,159,1,28.084332,,3,2,,2,3,,,,,,,
1-01-01-1-15-095,,Portugal,5,,1,0,1,29,2,,2,,,,82,1,182,1,24.755465,,2,,,1,1,,,,,,,
1-01-01-1-15-122,,Portugal,5,,1,1882.3092725251,1,27,2,,2,,,,118,1,190,1,32.686981,,4,1,,3,3,,,,,,,
1-01-01-1-16-001,,Portugal,5,,1,1913.425697932,1,56,2,,2,,,,77,1,183,1,22.992624,,2,2,,3,2,,,,,,,
1-01-01-1-16-007,,Portugal,5,,1,1913.425697932,1,55,1,,2,,,,93,1,167,1,33.346481,,4,1,,1,2,,,,,,,
1-01-01-1-16-014,,Portugal,5,,1,1913.425697932,1,49,2,,2,,,,67,1,180,1,20.679012,,2,2,,1,1,,,,,,,
1-01-01-1-16-022,,Portugal,5,,1,1913.425697932,1,61,1,,2,,,,64,1,165,1,23.507805,,2,3,,1,2,,,,,,,
1-01-01-1-16-085,,Portugal,5,,1,1913.425697932,1,40,2,,2,,,,96,1,178,1,30.299204,,4,2,,1,3,,,,,,,
1-01-01-1-16-101,,Portugal,5,,1,1913.425697932,1,54,3,,2,,,,70,1,166,1,25.402817,,3,2,,2,3,,,,,,,
1-01-01-1-16-112,,Portugal,5,,1,0,1,55,2,,2,,,,81,1,169,1,28.360352,,3,,,,2,,,,,,,
1-01-01-1-17-086,,Portugal,5,,1,5044.9003057799,1,66,1,,2,,,,61,1,177,1,19.470778,,2,2,,3,2,,,,,,,
1-01-01-2-15-043,,Portugal,5,,1,1882.3092725251,1,28,3,,2,,,,75,1,170,1,25.951557,,3,1,,1,1,,,,,,,
1-01-01-2-15-058,,Portugal,5,,1,0,1,23,1,,2,,,,67,1,173,1,22.386314,,2,,,1,1,,,,,,,
1-01-01-2-16-057,,Portugal,5,,1,1913.425697932,1,57,1,,2,,,,72,1,168,1,25.510204,,3,1,,1,1,,,,,,,
1-01-01-3-15-012,,Portugal,5,,1,0,1,28,2,,2,,,,69,1,169,1,24.158817,,2,,,2,1,,,,,,,
1-01-01-3-15-054,,Portugal,5,,1,1882.3092725251,1,27,3,,2,,,,76,1,174,1,25.102392,,3,2,,3,3,,,,,,,
1-01-01-3-15-058,,Portugal,5,,1,1882.3092725251,1,31,2,,2,,,,72,1,173,1,24.056934,,2,2,,1,1,,,,,,,
1-01-01-3-15-061,,Portugal,5,,1,1882.3092725251,1,21,2,,2,,,,60,1,175,1,19.591837,,2,2,,1,3,,,,,,,
1-01-01-3-16-007,,Portugal,5,,1,1913.425697932,1,39,2,,2,,,,71,1,169,1,24.859074,,2,2,,2,3,,,,,,,
1-01-01-3-16-017,,Portugal,5,,1,1913.425697932,1,44,3,,2,,,,104,1,176,1,33.574379,,4,1,,1,2,,,,,,,
1-01-01-3-16-079,,Portugal,5,,1,1913.425697932,1,62,1,,2,,,,80,1,167,1,28.685144,,3,2,,1,2,,,,,,,
1-01-01-3-16-104,,Portugal,5,,1,1913.425697932,1,36,3,,2,,,,84,1,176,1,27.117769,,3,1,,3,1,,,,,,,
1-01-01-4-15-043,,Portugal,5,,1,1882.3092725251,1,19,2,,2,,,,64,1,179,1,,,2,2,,3,3,,,,,,19.974407,-.91
1-01-01-4-16-008,,Portugal,5,,1,1913.425697932,1,38,2,,2,,,,69,1,177,1,22.024323,,2,2,,1,1,,,,,,,
1-01-01-4-16-085,,Portugal,5,,1,1913.425697932,1,63,1,,2,,,,78,1,176,1,25.180784,,3,2,,2,3,,,,,,,
1-01-01-4-16-088,,Portugal,5,,1,0,1,51,2,,2,,,,79,1,170,1,27.33564,,3,,,1,1,,,,,,,
1-01-01-4-16-133,,Portugal,5,,1,1913.425697932,1,54,2,,2,,,,80,1,159,1,31.644318,,4,1,,1,3,,,,,,,
1-01-01-5-15-006,,Portugal,5,,1,0,1,27,2,,2,,,,90,1,189,1,25.195263,,3,,,1,1,,,,,,,
1-01-01-5-15-008,,Portugal,5,,1,1882.3092725251,1,31,3,,2,,,,71,1,176,1,22.920971,,2,2,,2,3,,,,,,,
1-01-01-5-16-025,,Portugal,5,,1,1913.425697932,1,55,2,,2,,,,67,1,168,1,23.738663,,2,1,,2,3,,,,,,,
1-01-01-5-16-045,,Portugal,5,,1,1913.425697932,1,58,2,,2,,,,67,1,168,1,23.738663,,2,2,,2,3,,,,,,,
1-02-01-0-01-051,,Portugal,5,,1,188.2299,2,.83,2,,2,0,3,,7,1,68,1,,,2,,,,,,,,,,15.138409,-1.65
1-02-01-0-01-104,,Portugal,5,,1,188.2299,2,.76,3,,2,0,0,,7,1,68,1,,,2,,,,,,,,,,15.138409,-.46
1-02-01-0-01-115,,Portugal,5,,1,188.2299,2,.46,3,,2,0,3,,7,1,70,1,,,2,,,,,,,,,,14.285714,-1.19
1-02-01-0-02-066,,Portugal,5,,1,188.2299,2,1.56,2,,2,0,0,,11,1,84,1,,,2,,,,,,,,,,15.589569,.38
1-02-01-0-04-029,,Portugal,5,,1,1436.32,2,11,3,,2,0,,,45,1,157,1,,,2,,,,,,,,,,18.256319,.23
1-02-01-0-04-117,,Portugal,5,,1,1436.32,2,16,1,,2,0,,,43,1,150,1,,,2,2,,2,1,,,,,,19.111111,-.69
1-02-01-0-05-003,,Portugal,5,,1,5065.715,2,32,3,,2,1,,,66,1,171,1,22.571047,,2,,,2,3,,,,,,,
1-02-01-0-05-084,,Portugal,5,,1,5065.715,2,22,2,,2,0,,,62,1,173,1,20.715694,,2,2,,2,3,,,,,,,
1-02-01-0-05-092,,Portugal,5,,1,0,2,28,2,,2,2,,,52,1,160,1,20.3125,,2,,,3,2,,,,,,,
1-02-01-0-06-032,,Portugal,5,,1,3215.626,2,39,3,,2,0,,,71,1,152,1,30.73061,,4,2,,2,2,,,,,,,
1-02-01-0-06-048,,Portugal,5,,1,0,2,54,1,,2,0,,,75,1,161,1,28.934069,,3,,,3,1,,,,,,,
1-02-01-0-06-069,,Portugal,5,,1,3215.626,2,53,1,,2,0,,,90,1,163,1,33.874065,,4,2,,3,3,,,,,,,
1-02-01-0-06-082,,Portugal,5,,1,3215.626,2,39,1,,2,0,,,55,1,169,1,19.257029,,2,2,,2,2,,,,,,,
1-02-01-0-06-105,,Portugal,5,,1,3215.626,2,54,3,,2,0,,,74,1,160,1,28.90625,,3,2,,1,1,,,,,,,
1-02-01-0-06-110,,Portugal,5,,1,3215.626,2,36,2,,2,0,,,86,1,161,1,33.177731,,4,1,,3,3,,,,,,,
1-02-01-0-06-118,,Portugal,5,,1,3215.626,2,40,3,,2,0,,,71,1,161,1,27.390919,,3,2,,2,2,,,,,,,
1-02-01-0-06-132,,Portugal,5,,1,3215.626,2,55,3,,2,0,,,54,1,157,1,21.907583,,2,2,,2,2,,,,,,,
1-02-01-0-07-024,,Portugal,5,,1,4177.789,2,68,3,,2,0,,,55,1,159,1,21.755468,,2,2,,2,2,,,,,,,
1-02-01-0-07-036,,Portugal,5,,1,4177.789,2,66,3,,2,0,,,63,1,154,1,26.564344,,3,2,,2,2,,,,,,,
1-02-01-0-12-039,,Portugal,5,,1,160.0087,1,1.84,3,,2,,0,,14,1,93,1,,,2,,,,,,,,,,16.186842,.09
1-02-01-0-12-041,,Portugal,5,,1,160.0087,1,1.57,3,,2,,0,,12,1,91,1,,,2,,,,,,,,,,14.491003,-1.94
1-02-01-0-12-055,,Portugal,5,,1,0,1,1.78,2,,2,,0,,11,1,88,1,,,2,,,,,,,,,,14.204545,-1.42
1-02-01-0-13-135,,Portugal,5,,1,1832.081,1,3,2,,2,,0,,18,1,101,1,,,3,,,,,,,,,,17.645329,1.46
1-02-01-0-15-030,,Portugal,5,,1,6749.502,1,24,3,,2,,,,67,1,171,1,22.913033,,2,2,,2,3,,,,,,,
1-02-01-0-15-038,,Portugal,5,,1,6749.502,1,32,2,,2,,,,95,1,182,1,28.680111,,3,2,,3,1,,,,,,,
1-02-01-0-16-031,,Portugal,5,,1,4120.059,1,59,3,,2,,,,71,1,175,1,23.183674,,2,1,,3,3,,,,,,,
1-02-01-0-16-037,,Portugal,5,,1,4120.059,1,56,2,,2,,,,92,1,178,1,29.036737,,3,1,,3,2,,,,,,,
1-02-01-0-16-059,,Portugal,5,,1,4120.059,1,58,2,,2,,,,53,1,162,1,20.195093,,2,2,,1,1,,,,,,,
1-02-01-0-16-080,,Portugal,5,,1,4120.059,1,36,3,,2,,,,68,1,162,1,25.910685,,3,1,,3,2,,,,,,,
1-02-01-0-16-113,,Portugal,5,,1,4120.059,1,43,1,,2,,,,55,1,166,1,19.959356,,2,2,,2,1,,,,,,,
1-02-01-0-17-049,,Portugal,5,,1,5760.585,1,66,1,,2,,,,99,1,175,1,32.32653,,4,2,,2,2,,,,,,,
1-02-01-0-17-063,,Portugal,5,,1,5760.585,1,71,3,,2,,,,72,1,167,1,25.816629,,3,2,,1,1,,,,,,,
1-02-01-1-02-063,,Portugal,5,,1,0,2,1.72,2,,2,0,0,,10,1,88,1,,,1,,,,,,,,,,12.913223,-2.13
1-02-01-1-02-115,,Portugal,5,,1,188.2299,2,1.56,2,,2,0,0,,11,1,88,1,,,2,,,,,,,,,,14.204545,-.8100000000000001
1-02-01-1-04-016,,Portugal,5,,1,1436.32,2,15,3,,2,0,,,49,1,147,1,,,2,1,,3,,,,,,,22.675737,.64
1-02-01-1-04-107,,Portugal,5,,1,0,2,14,2,,2,0,,,72,1,163,1,,,3,,,,,,,,,,27.099251,1.93
1-02-01-1-06-001,,Portugal,5,,1,3215.626,2,61,3,,2,0,,,55,1,161,1,21.218317,,2,2,,2,2,,,,,,,
1-02-01-1-06-005,,Portugal,5,,1,3215.626,2,54,3,,2,0,,,50,1,154,1,21.082813,,2,2,,1,2,,,,,,,
1-02-01-1-06-030,,Portugal,5,,1,3215.626,2,48,1,,2,0,,,87,1,158,1,34.850185,,4,2,,,3,,,,,,,
1-02-01-1-06-059,,Portugal,5,,1,3215.626,2,45,3,,2,0,,,66,1,162,1,25.148605,,3,2,,2,3,,,,,,,
1-02-01-1-06-079,,Portugal,5,,1,3215.626,2,41,3,,2,0,,,55,1,168,1,19.486961,,2,2,,1,3,,,,,,,
1-02-01-1-06-085,,Portugal,5,,1,3215.626,2,56,2,,2,0,,,61,1,141,1,30.682562,,4,1,,3,2,,,,,,,
1-02-01-1-06-094,,Portugal,5,,1,3215.626,2,52,3,,2,0,,,56,1,158,1,22.432302,,2,2,,2,1,,,,,,,
1-02-01-1-06-109,,Portugal,5,,1,3215.626,2,45,1,,2,0,,,72,1,161,1,27.776707,,3,1,,3,3,,,,,,,
1-02-01-1-06-114,,Portugal,5,,1,0,2,52,3,,2,0,,,54,1,152,1,23.372576,,2,,,2,1,,,,,,,
1-02-01-1-06-126,,Portugal,5,,1,3215.626,2,44,1,,2,0,,,88,1,150,1,39.111111,,4,1,,3,3,,,,,,,
1-02-01-1-06-128,,Portugal,5,,1,3215.626,2,45,1,,2,0,,,64,1,169,1,22.408178,,2,2,,3,1,,,,,,,
1-02-01-1-07-127,,Portugal,5,,1,4177.789,2,71,2,,2,0,,,68,1,153,1,29.048656,,3,2,,3,2,,,,,,,
1-02-01-1-12-003,,Portugal,5,,1,0,1,1.82,3,,2,,0,,11,1,89,1,,,2,,,,,,,,,,13.887136,-1.38
1-02-01-1-12-011,,Portugal,5,,1,160.0087,1,1.13,3,,2,,0,,11,1,81,1,,,2,,,,,,,,,,16.765738,-.34
1-02-01-1-12-050,,Portugal,5,,1,160.0087,1,2,3,,2,,0,,12,1,88,1,,,2,,,,,,,,,,15.495868,-.6
1-02-01-1-13-087,,Portugal,5,,1,1832.081,1,5,3,,2,,0,,24,1,123,1,,,2,,,,,,,,,,15.863573,.33
1-02-01-1-14-098,,Portugal,5,,1,1859.331,1,15,3,,2,,,,64,1,173,1,,,2,2,,2,,,,,,,21.383942,.45
1-02-01-1-14-129,,Portugal,5,,1,1859.331,1,14,2,,2,,,,82,1,173,1,,,4,,,,,,,,,,27.398176,2.13
1-02-01-1-15-013,,Portugal,5,,1,0,1,21,1,,2,,,,56,1,174,1,18.496498,,1,,,2,1,,,,,,,
1-02-01-1-15-020,,Portugal,5,,1,6749.502,1,28,3,,2,,,,95,1,185,1,27.757486,,3,1,,3,3,,,,,,,
1-02-01-1-16-070,,Portugal,5,,1,4120.059,1,52,3,,2,,,,77,1,178,1,24.302486,,2,2,,3,1,,,,,,,
1-02-01-1-16-075,,Portugal,5,,1,4120.059,1,59,1,,2,,,,85,1,171,1,29.068773,,3,1,,2,1,,,,,,,
1-02-01-1-16-078,,Portugal,5,,1,4120.059,1,40,3,,2,,,,70,1,172,1,23.661438,,2,2,,1,3,,,,,,,
1-02-01-1-16-084,,Portugal,5,,1,0,1,54,3,,2,,,,82,1,169,1,28.71048,,3,,,1,3,,,,,,,
1-02-01-1-16-088,,Portugal,5,,1,4120.059,1,50,2,,2,,,,63,1,170,1,21.799309,,2,2,,1,1,,,,,,,
1-02-01-1-17-062,,Portugal,5,,1,5760.585,1,67,3,,2,,,,73,1,166,1,26.491508,,3,2,,3,2,,,,,,,
1-02-01-1-17-097,,Portugal,5,,1,5760.585,1,65,2,,2,,,,71,1,173,1,23.722811,,2,2,,1,1,,,,,,,
1-03-01-0-02-025,,Portugal,5,,1,456.6296,2,2,2,,2,0,0,,15,1,89,1,,,4,,,,,,,,,,18.937002,2.12
1-03-01-0-03-078,,Portugal,5,,1,3055.402,2,8,2,,2,0,,,26,1,123,1,,,2,,,,,,,,,,17.185537,.62
1-03-01-0-05-034,,Portugal,5,,1,6355.216,2,21,2,,2,0,,,63,1,163,1,23.711845,,2,2,,1,3,,,,,,,
1-03-01-0-05-114,,Portugal,5,,1,0,2,28,2,,2,0,,,64,1,151,1,28.068945,,3,,,3,1,,,,,,,
1-03-01-0-06-032,,Portugal,5,,1,6523.285,2,59,1,,2,0,,,66,1,155,1,27.471384,,3,1,,1,3,,,,,,,
1-03-01-0-06-085,,Portugal,5,,1,6523.285,2,52,1,,2,0,,,101,1,168,1,35.785149,,4,1,,3,3,,,,,,,
1-03-01-0-06-086,,Portugal,5,,1,6523.285,2,39,3,,2,0,,,51,1,157,1,20.690495,,2,2,,2,3,,,,,,,
1-03-01-0-06-136,,Portugal,5,,1,6523.285,2,37,2,,2,0,,,73,1,157,1,29.615807,,3,1,,3,1,,,,,,,
1-03-01-0-12-118,,Portugal,5,,1,656.6532,1,1.9,3,,2,,0,,12,1,82,1,,,3,,,,,,,,,,17.846519,1.32
1-03-01-0-14-047,,Portugal,5,,1,3799.655,1,10,2,,2,,,,36,1,142,1,,,2,,,,,,,,,,17.8536,.46
1-03-01-0-14-096,,Portugal,5,,1,3799.655,1,13,3,,2,,,,66,1,169,1,,,3,,,,,,,,,,23.108435,1.59
1-03-01-0-15-070,,Portugal,5,,1,6173.962,1,27,2,,2,,,,97,1,169,1,33.962395,,4,2,,1,1,,,,,,,
1-03-01-0-15-079,,Portugal,5,,1,6173.962,1,31,2,,2,,,,74,1,174,1,24.441803,,2,2,,3,1,,,,,,,
1-03-01-0-16-055,,Portugal,5,,1,8072.317,1,64,1,,2,,,,71,1,159,1,28.084332,,3,1,,1,3,,,,,,,
1-03-01-0-16-069,,Portugal,5,,1,8072.317,1,61,1,,2,,,,88,1,172,1,29.745808,,3,1,,3,2,,,,,,,
1-03-02-0-03-058,,Portugal,5,,1,3055.402,2,6,3,,2,0,,,23,1,119,1,,,2,,,,,,,,,,16.241791,.42
1-03-02-0-04-042,,Portugal,5,,1,3609.672,2,14,2,,2,0,,,57,1,160,1,,,2,,,,,,,,,,22.265625,.72
1-03-02-0-04-048,,Portugal,5,,1,0,2,14,2,,2,0,,,40,1,151,1,,,2,,,,,,,,,,17.543091,-.94
1-03-02-0-05-037,,Portugal,5,,1,0,2,20,2,,2,0,,,57,1,149,1,25.674519,,3,,,2,3,,,,,,,
1-03-02-0-06-007,,Portugal,5,,1,6523.285,2,47,1,,2,0,,,58,1,144,1,27.970678,,3,2,,3,3,,,,,,,
1-03-02-0-06-029,,Portugal,5,,1,6523.285,2,39,2,,2,0,,,54,1,152,1,23.372576,,2,2,,2,3,,,,,,,
1-03-02-0-15-121,,Portugal,5,,1,6173.962,1,28,2,,2,,,,69,1,173,1,23.054562,,2,2,,2,2,,,,,,,
1-03-02-0-16-100,,Portugal,5,,1,8072.317,1,39,1,,2,,,,84,1,171,1,28.726788,,3,2,,2,3,,,,,,,
1-03-02-0-16-110,,Portugal,5,,1,8072.317,1,43,1,,2,,,,62,1,167,1,22.230988,,2,1,,2,1,,,,,,,
1-03-03-0-02-004,,Portugal,5,,1,456.6296,2,1.6,1,,2,0,0,,10,1,80,1,,,2,,,,,,,,,,15.625,.67
1-03-03-0-04-044,,Portugal,5,,1,3609.672,2,13,1,,2,0,,,47,1,151,1,,,2,,,,,,,,,,20.613131,.46
1-03-03-0-13-018,,Portugal,5,,1,3170.591,1,7,1,,2,,,,24,1,122,1,,,2,,,,,,,,,,16.124697,.34
1-03-03-0-15-122,,Portugal,5,,1,0,1,33,2,,2,,,,103,1,176,1,33.251549,,4,,,1,1,,,,,,,
1-03-03-0-15-132,,Portugal,5,,1,6173.962,1,25,3,,2,,,,71,1,175,1,23.183674,,2,2,,2,3,,,,,,,
1-04-01-0-01-095,,Portugal,5,,1,402.7778,2,1.01,2,,2,0,0,,11,1,78,1,,,3,,,,,,,,,,18.08021,1.07
1-04-01-0-03-053,,Portugal,5,,1,2125,2,8,2,,2,0,,,35,1,139,1,,,3,,,,,,,,,,18.115004,1.13
1-04-01-0-03-131,,Portugal,5,,1,0,2,6,2,,2,0,,,24,1,115,1,,,3,,,,,,,,,,18.147448,1.38
1-04-01-0-04-030,,Portugal,5,,1,1768.519,2,13,3,,2,0,,,50,1,154,1,,,2,,,,,,,,,,21.082813,.61
1-04-01-0-04-055,,Portugal,5,,1,1768.519,2,12,3,,2,0,,,71,1,167,1,,,4,,,,,,,,,,25.458065,2.05
1-04-01-0-04-119,,Portugal,5,,1,1768.519,2,11,,,2,0,,,59,1,160,1,,,3,,,,,,,,,,23.046875,1.61
1-04-01-0-05-063,,Portugal,5,,1,2270.833,2,21,2,,2,0,,,66,1,153,1,28.194284,,3,1,,3,1,,,,,,,
1-04-01-0-05-094,,Portugal,5,,1,2270.833,2,28,2,,2,0,,,68,1,160,1,26.5625,,3,2,,1,1,,,,,,,
1-04-01-0-05-098,,Portugal,5,,1,2270.833,2,23,2,,2,0,,,54,1,160,1,21.09375,,2,2,,1,2,,,,,,,
1-04-01-0-05-138,,Portugal,5,,1,2270.833,2,31,2,,2,0,,,72,1,173,1,24.056934,,2,1,,2,1,,,,,,,
1-04-01-0-07-036,,Portugal,5,,1,26833.33,2,71,1,,2,0,,,61,1,152,1,26.402355,,3,2,,3,3,,,,,,,
1-04-01-0-12-137,,Portugal,5,,1,569.4444,1,1.75,3,,2,,3,,12,1,89,1,,,2,,,,,,,,,,15.149602,-.48
1-04-01-0-13-018,,Portugal,5,,1,816.6667,1,3,2,,2,,0,,24,1,107,1,,,4,,,,,,,,,,20.96253,3.51
1-04-01-0-13-029,,Portugal,5,,1,816.6667,1,8,3,,2,,,,30,1,131,1,,,3,,,,,,,,,,17.481499,1.02
1-04-01-0-13-032,,Portugal,5,,1,816.6667,1,5,2,,2,,0,,20,1,111,1,,,2,,,,,,,,,,16.232449,.6
1-04-01-0-14-116,,Portugal,5,,1,1777.778,1,13,3,,2,,,,67,1,165,1,,,3,,,,,,,,,,24.609734,1.86
1-04-01-0-14-125,,Portugal,5,,1,1777.778,1,12,2,,2,,,,36,1,161,1,,,1,,,,,,,,,,13.888353,-2.45
1-04-01-0-14-132,,Portugal,5,,1,1777.778,1,15,3,,2,,,,60,1,174,1,,,2,2,,2,,,,,,,19.817677,-.25
1-04-01-0-16-054,,Portugal,5,,1,5302.083,1,53,3,,2,,,,93,1,178,1,29.352354,,3,2,,3,2,,,,,,,
1-04-01-0-16-062,,Portugal,5,,1,5302.083,1,39,2,,2,,,,79,1,177,1,25.216253,,3,2,,3,3,,,,,,,
1-04-01-0-16-117,,Portugal,5,,1,5302.083,1,63,1,,2,,,,85,1,169,1,29.760862,,3,2,,2,3,,,,,,,
1-04-01-0-16-123,,Portugal,5,,1,5302.083,1,43,1,,2,,,,82,1,168,1,29.053288,,3,1,,1,1,,,,,,,
1-04-01-0-16-136,,Portugal,5,,1,5302.083,1,57,3,,2,,,,101,1,171,1,34.540543,,4,2,,1,2,,,,,,,
1-04-01-0-17-009,,Portugal,5,,1,8611.111000000001,1,69,1,,2,,,,89,1,164,1,33.090424,,4,2,,3,1,,,,,,,
1-04-01-1-02-081,,Portugal,5,,1,402.7778,2,1.87,3,,2,0,0,,14,1,92,1,,,2,,,,,,,,,,16.540642,.59
1-04-01-1-03-127,,Portugal,5,,1,2125,2,7,3,,2,0,,,31,1,130,1,,,3,,,,,,,,,,18.343195,1.32
1-04-01-1-05-038,,Portugal,5,,1,2270.833,2,32,2,,2,0,,,56,1,158,1,22.432302,,2,2,,2,1,,,,,,,
1-04-01-1-05-070,,Portugal,5,,1,2270.833,2,30,3,,2,0,,,66,1,165,1,24.242424,,2,2,,1,3,,,,,,,
1-04-01-1-05-083,,Portugal,5,,1,2270.833,2,32,2,,2,1,,,70,1,161,1,27.005131,,3,,,1,2,,,,,,,
1-04-01-1-05-128,,Portugal,5,,1,2270.833,2,34,1,,2,0,,,70,1,163,1,26.346495,,3,1,,2,3,,,,,,,
1-04-01-1-06-015,,Portugal,5,,1,22250,2,36,2,,2,0,,,62,1,161,1,23.918831,,2,1,,3,3,,,,,,,
1-04-01-1-06-110,,Portugal,5,,1,22250,2,60,1,,2,0,,,87,1,157,1,35.295551,,4,1,,3,3,,,,,,,
1-04-01-1-12-098,,Portugal,5,,1,569.4444,1,2,3,,2,,0,,12,1,87,1,,,2,,,,,,,,,,15.854142,-.18
1-04-01-1-13-007,,Portugal,5,,1,816.6667,1,6,3,,2,,,,20,1,116,1,,,2,,,,,,,,,,14.863258,-.26
1-04-01-1-13-008,,Portugal,5,,1,816.6667,1,5,2,,2,,0,,16,1,99,1,,,2,,,,,,,,,,16.324865,.7
1-04-01-1-15-137,,Portugal,5,,1,21861.11,1,31,2,,2,,,,76,1,169,1,26.609713,,3,1,,3,1,,,,,,,
1-04-01-1-16-020,,Portugal,5,,1,5302.083,1,41,3,,2,,,,89,1,188,1,25.181078,,3,2,,3,1,,,,,,,
1-04-01-1-16-046,,Portugal,5,,1,5302.083,1,43,2,,1,,,,61,1,175,1,19.918367,,2,2,,3,3,,,,,,,
1-04-01-1-16-103,,Portugal,5,,1,5302.083,1,55,1,,2,,,,99,1,168,1,35.07653,,4,1,,2,2,,,,,,,
1-04-01-1-17-088,,Portugal,5,,1,8611.111000000001,1,70,2,,2,,,,104,1,168,1,36.848072,,4,2,,1,2,,,,,,,
1-05-01-0-01-038,,Portugal,5,,1,505.0611,2,.8,2,,2,0,3,,10,1,72,1,,,3,,,,,,,,,,19.290123,1.6
1-05-01-0-01-125,,Portugal,5,,1,505.0611,2,1.15,3,,2,0,3,,10,1,80,1,,,2,,,,,,,,,,15.625,-.11
1-05-01-0-02-063,,Portugal,5,,1,0,2,1.98,3,,2,0,0,,12,1,86,1,,,2,,,,,,,,,,16.224987,.44
1-05-01-0-03-023,,Portugal,5,,1,3048.245,2,7,2,,2,0,,,24,1,126,1,,,2,,,,,,,,,,15.117158,-.22
1-05-01-0-04-102,,Portugal,5,,1,0,2,15,2,,2,0,,,56,1,165,1,,,2,,,3,3,,,,,,20.56933,.01
1-05-01-0-04-124,,Portugal,5,,1,3820.598,2,17,1,,2,0,,,36,1,157,1,,,1,2,,1,,,,,,,14.605055,-3.03
1-05-01-0-04-134,,Portugal,5,,1,3820.598,2,15,2,,2,0,,,60,1,166,1,,,2,2,,2,,,,,,,21.773842,.47
1-05-01-0-05-013,,Portugal,5,,1,0,2,30,2,,2,0,,,77,1,166,1,27.943098,,3,,,3,3,,,,,,,
1-05-01-0-05-019,,Portugal,5,,1,3264.119,2,25,2,,2,0,,,56,1,158,1,22.432302,,2,1,,1,3,,,,,,,
1-05-01-0-05-070,,Portugal,5,,1,3264.119,2,33,2,,2,0,,,50,1,151,1,21.928864,,2,3,,,2,,,,,,,
1-05-01-0-05-079,,Portugal,5,,1,3264.119,2,30,2,,2,0,,,57,1,160,1,22.265625,,2,2,,,1,,,,,,,
1-05-01-0-05-090,,Portugal,5,,1,3264.119,2,18,2,,2,0,,,58,1,153,1,,,3,1,,2,3,,,,,,24.776794,1.01
1-05-01-0-05-091,,Portugal,5,,1,3264.119,2,31,3,,2,0,,,58,1,152,1,25.103878,,3,1,,1,3,,,,,,,
1-05-01-0-06-034,,Portugal,5,,1,3531.003,2,41,2,,2,0,,,48,1,150,1,21.333334,,2,2,,2,3,,,,,,,
1-05-01-0-06-043,,Portugal,5,,1,3531.003,2,47,1,,2,0,,,88,1,155,1,36.628513,,4,2,,,3,,,,,,,
1-05-01-0-06-061,,Portugal,5,,1,3531.003,2,37,2,,2,2,,,56,1,161,1,21.604105,,2,,,1,1,,,,,,,
1-05-01-0-06-071,,Portugal,5,,1,3531.003,2,49,1,,2,0,,,66,1,162,1,25.148605,,3,2,,3,3,,,,,,,
1-05-01-0-06-073,,Portugal,5,,1,3531.003,2,41,2,,2,0,,,71,1,157,1,28.804415,,3,2,,1,2,,,,,,,
1-05-01-0-06-111,,Portugal,5,,1,3531.003,2,38,2,,2,0,,,64,1,156,1,26.298489,,3,2,,1,3,,,,,,,
1-05-01-0-06-115,,Portugal,5,,1,3531.003,2,51,2,,2,0,,,84,1,157,1,34.078461,,4,2,,2,3,,,,,,,
1-05-01-0-06-126,,Portugal,5,,1,3531.003,2,49,2,,2,0,,,41,1,134,1,22.833593,,2,2,,2,3,,,,,,,
1-05-01-0-08-069,,Portugal,5,,1,30258.87,2,76,1,,2,0,,,54,1,150,1,24,,2,2,,1,3,,,,,,,
1-05-01-0-11-066,,Portugal,5,,1,693.4833,1,.47,2,,2,,3,,7,1,62,1,,,2,,,,,,,,,,18.210197,.57
1-05-01-0-12-041,,Portugal,5,,1,693.4833,1,1.86,2,,2,,0,,14,1,86,1,,,3,,,,,,,,,,18.929152,1.75
1-05-01-0-13-021,,Portugal,5,,1,3432.004,1,7,2,,2,,,,26,1,131,1,,,2,,,,,,,,,,15.150632,-.61
1-05-01-0-13-128,,Portugal,5,,1,3432.004,1,6,2,,2,,,,27,1,122,1,,,3,,,,,,,,,,18.140285,1.59
1-05-01-0-14-014,,Portugal,5,,1,4476.744,1,11,2,,2,,,,39,1,144,1,,,2,,,,,,,,,,18.807871,.64
1-05-01-0-14-050,,Portugal,5,,1,0,1,14,1,,2,,,,60,1,175,1,,,2,,,,,,,,,,19.591837,.19
1-05-01-0-14-133,,Portugal,5,,1,4476.744,1,10,2,,2,,,,38,1,150,1,,,2,,,,,,,,,,16.888889,-.02
1-05-01-0-15-094,,Portugal,5,,1,3421.637,1,34,3,,2,,,,87,1,175,1,28.408163,,3,2,,1,3,,,,,,,
1-05-01-0-16-025,,Portugal,5,,1,3876.896,1,59,1,,2,,,,89,1,164,1,33.090424,,4,1,,2,3,,,,,,,
1-05-01-0-16-036,,Portugal,5,,1,3876.896,1,54,1,,2,,,,99,1,182,1,29.887695,,3,1,,2,2,,,,,,,
1-05-01-0-16-083,,Portugal,5,,1,3876.896,1,58,1,,2,,,,86,1,175,1,28.081633,,3,2,,1,2,,,,,,,
1-05-01-0-16-093,,Portugal,5,,1,3876.896,1,35,1,,2,,,,65,1,164,1,24.167162,,2,3,,3,1,,,,,,,
1-05-01-0-16-096,,Portugal,5,,1,3876.896,1,55,2,,2,,,,90,1,175,1,29.387754,,3,2,,2,2,,,,,,,
1-05-01-0-16-135,,Portugal,5,,1,3876.896,1,54,1,,2,,,,92,1,162,1,35.055634,,4,2,,1,1,,,,,,,
1-05-01-0-17-002,,Portugal,5,,1,5856.873,1,67,2,,2,,,,71,1,174,1,23.450918,,2,1,,3,3,,,,,,,
1-05-01-0-17-031,,Portugal,5,,1,5856.873,1,65,1,,2,,,,93,1,168,1,32.95068,,4,2,,3,1,,,,,,,
1-05-01-0-18-110,,Portugal,5,,1,5856.873,1,79,1,,2,,,,95,1,166,1,34.47525,,4,1,,2,2,,,,,,,