id,hh_id,country,sec_area,tert_area,round,smpl_weight,sex,age,edc_level,edc,residence,preg_lact,breastfeeding,hh_head,wgt,wgt_method,hgt,hgt_method,bmi_adults,bmi_children,bmi_cat,misrep,pa,pa_cat,smok,special_diet,special_diet_other,clin_diet,clin_diet_other,note,smpl_wgt_bmi,bmi_chld,hh_size,wgt_rprt,hgt_rprt,bmi_rprt,pa_mod_vig,pa_chld,sed_chld
1,,Canada,9,,2,859,2,27,2,,,,,,50.700001,1,158,1,20.309999,,2,,,,4,,,,,,1131,,2,,,,0,,
2,,Canada,8,,4,901,1,48,2,,,,,,108.5,1,173.5,1,36.040001,,4,,,,4,,,,,,1090,,1,,,,2,,
3,,Canada,6,,3,4431,2,74,4,,,,,,55.599998,1,161,1,21.450001,,2,,,,4,,,,,,9007,,2,,,,3.75,,
4,,Canada,3,,1,539,2,39,3,,,,,,,,,,,,,,,,4,,,,,,NA,,3,68.400002,170.2,23.610001,1.5,,
5,,Canada,8,,1,703,1,28,4,,,,,,62.650002,1,165,1,23.01,,2,,,,1,,,,,,893,,2,,,,14,,
6,,Canada,7,,2,42,2,52,2,,,,,,62.900002,1,155.5,1,26.01,,3,,,,1,,,,,,65,,1,,,,3.75,,
7,,Canada,6,,3,1949,2,40,3,,,,,,140.45,1,173,1,46.93,,4,,,,4,,,,,,2648,,4,,,,.76700002,,
8,,Canada,4,,2,344,2,29,3,,,,,,53.349998,1,162.5,1,20.200001,,2,,,,4,,,,,,391,,3,,,,2,,
9,,Canada,9,,6,8206,1,23,2,,,,,,,,,,,,,,,,4,,,,,,NA,,3,82.349998,175.3,26.799999,10.5,,
10,,Canada,9,,3,336,1,61,3,,,,,,79,1,185,1,23.08,,2,,,,4,,,,,,463,,3,,,,10,,
11,,Canada,10,,6,90,1,17,4,,,,,,,,,,,,,,,,4,,,,,,NA,,2,72,182.89999,21.52,,5,2
12,,Canada,8,,5,318,1,17,4,,,,,,69.099998,1,187,1,,,2,,,,4,,,,,,398,19.76,4,,,,,11,4
13,,Canada,3,,2,80,1,62,3,,,,,,84.650002,1,169,1,29.639999,,3,,,,4,,,,,,101,,2,,,,2.3,,
14,,Canada,5,,4,3861,1,56,2,,,,,,87.5,1,173,1,29.24,,3,,,,1,,,,,,8056,,2,,,,0,,
15,,Canada,6,,2,1060,1,58,3,,,,,,76.949997,1,171,1,26.32,,3,,,,4,,,,,,1927,,3,,,,.21699999,,
16,,Canada,6,,5,1140,2,17,4,,,,,,47.150002,1,160,1,,,2,,,,4,,,,,,1376,18.42,3,,,,,14,12
17,,Canada,9,,2,458,1,37,3,,,,,,70.800003,1,165.5,1,25.85,,3,,,,4,,,,,,572,,4,,,,0,,
18,,Canada,6,,1,2188,2,49,3,,,,,,74.349998,1,173.5,1,24.700001,,2,,,,4,,,,,,3114,,1,,,,5.25,,
19,,Canada,10,,1,386,1,7,4,,,,,,21.450001,1,120.00001,1,,,2,,,,,,,,,,447,14.9,4,,,,,15,1
20,,Canada,10,,1,2185,1,9,4,,,,,,25.200001,1,131.5,1,,,2,,,,,,,,,,2098,14.57,4,,,,,10,2
21,,Canada,6,,1,1113,2,54,3,,,,,,,,,,,,,,,,4,,,,,,NA,,3,,,,2.25,,
22,,Canada,7,,4,214,2,3,4,,,,,,,,,,,,,,,,,,,,,,NA,,4,19.35,109.2,16.23,,,
23,,Canada,8,,6,55,1,63,3,,,,,,140,1,,,,,,,,,4,,,,,,NA,,2,,,,1.9170001,,
24,,Canada,3,,1,418,1,72,2,,,,,,90.849998,1,184.5,1,26.690001,,3,,,,4,,,,,,743,,1,,,,1.517,,
25,,Canada,10,,2,352,1,34,3,,,,,,,,,,,,,,,,1,,,,,,NA,,1,77.400002,172.7,25.950001,3,,
26,,Canada,6,,2,2393,2,60,2,,,,,,67.800003,1,156.5,1,27.68,,3,,,,1,,,,,,3112,,2,,,,2,,
27,,Canada,6,,2,166,1,35,3,,,,,,78,1,178,1,24.620001,,2,,,,1,,,,,,213,,1,,,,10.5,,
28,,Canada,5,,2,339,1,78,4,,,,,,88.449997,1,173,1,29.549999,,3,,,,4,,,,,,353,,3,,,,.38299999,,
29,,Canada,3,,2,152,2,58,2,,,,,,,,,,,,,,,,4,,,,,,NA,,2,119.7,165.10001,43.91,0,,
30,,Canada,6,,3,2139,1,51,3,,,,,,,,,,,,,,,,4,,,,,,NA,,5,83.25,167.60001,29.639999,7.5,,
31,,Canada,8,,6,1269,2,10,4,,,,,,,,,,,,,,,,,,,,,,NA,,5,32.849998,137.2,17.450001,,9,3
32,,Canada,7,,6,236,1,84,4,,,,,,,,,,,,,,,,4,,,,,,NA,,1,77.400002,180.3,23.809999,0,,
33,,Canada,5,,2,1017,2,1,4,,,,,,,,,,,,,,,,,,,,,,NA,,2,,,,,,
34,,Canada,10,,1,596,2,78,4,,,,,,110.2,1,165,1,40.48,,4,,,,4,,,,,,1113,,1,,,,.38299999,,
35,,Canada,6,,5,1805,2,80,4,,,,,,,,,,,,,,,,4,,,,,,NA,,2,58.950001,160,23.030001,14,,
36,,Canada,10,,2,593,1,62,4,,,,,,,,,,,,,,,,1,,,,,,NA,,3,74.25,170.2,25.629999,0,,
37,,Canada,6,,4,230,1,52,2,,,,,,,,170,1,,,,,,,1,,,,,,NA,,1,,,,2.25,,
38,,Canada,5,,4,1249,2,74,4,,,,,,48.5,1,153,1,20.719999,,2,,,,4,,,,,,2210,,1,,,,0,,
39,,Canada,10,,1,604,2,16,2,,,,,,57,1,170,1,,,2,,,,4,,,,,,623,19.719999,5,,,,,17,3
40,,Canada,5,,5,1027,2,34,3,,,,,,57,1,168,1,20.200001,,2,,,,4,,,,,,1330,,2,,,,5.25,,
41,,Canada,8,,4,1590,2,7,4,,,,,,,,,,,,,,,,,,,,,,NA,,5,23.85,132.09999,13.67,,13,1
42,,Canada,6,,1,367,1,42,3,,,,,,,,,,,,,,,,4,,,,,,NA,,1,128.25,170.2,44.27,1.5,,
43,,Canada,3,,2,1968,2,64,3,,,,,,76.400002,1,161,1,29.469999,,3,,,,4,,,,,,2761,,2,,,,0,,
44,,Canada,10,,3,1806,2,57,2,,,,,,83.150002,1,172,1,28.110001,,3,,,,4,,,,,,3854,,2,,,,1.084,,
45,,Canada,1,,3,700,2,44,3,,,,,,70,1,165,1,25.709999,,3,,,,4,1,,,,,1018,,4,,,,.75,,
46,,Canada,6,,2,1060,2,1,4,,,,,,,,,,,,,,,,,,,,,,NA,,3,,,,,,
47,,Canada,9,,6,1409,1,31,2,,,,,,,,,,,,,,,,4,,,,,,NA,,4,126,195.59999,32.93,4.5,,
48,,Canada,4,,2,440,1,59,2,,,,,,81.75,1,173,1,27.309999,,3,,,,4,,,,,,708,,3,,,,5.25,,
49,,Canada,5,,5,3070,1,2,4,,,,,,15.87,1,100,1,,,2,,,,,,,,,,6096,15.87,4,,,,,,
50,,Canada,10,,4,1486,2,56,3,,,,,,40.549999,1,,,,,,,,,4,,,,,,NA,,2,,154.90001,,2.6830001,,
51,,Canada,3,,3,657,2,82,4,,,,,,83.099998,1,158,1,33.290001,,4,,,,4,,,,,,821,,1,,,,0,,
52,,Canada,10,,6,186,2,55,3,,,,,,58.799999,1,168.5,1,20.709999,,2,,,,4,,,5,,,234,,1,,,,9,,
53,,Canada,6,,3,6274,2,80,4,,,,,,83.800003,1,165.5,1,30.59,,4,,,,4,,,,,,12753,,1,,,,0,,
54,,Canada,3,,3,38,1,52,3,,,,,,75.349998,1,170.5,1,25.92,,3,,,,4,,,,,,49,,1,,,,7.5,,
55,,Canada,9,,5,1300,2,12,4,,,,,,36.549999,1,151.5,1,,,2,,,,4,,,,,,1513,15.92,3,,,,,16,3.5
56,,Canada,1,,4,503,2,40,2,,,,,,90.599998,1,165.5,1,33.080002,,4,,,,4,,,,,,781,,4,,,,7.5,,
57,,Canada,3,,2,223,1,69,4,,,,,,108.55,1,182,1,32.77,,4,,,,4,,,,,,413,,2,,,,14,,
58,,Canada,6,,3,615,1,1,4,,,,,,,,,,,,,,,,,,,,,,NA,,3,,,,,,
59,,Canada,9,,2,2728,1,52,3,,,,,,69.400002,1,177.5,1,22.030001,,2,,,,4,,,,,,3762,,3,,,,4.5,,
60,,Canada,3,,3,134,1,4,4,,,,,,20.700001,1,110.5,1,,,2,,,,,,,,,,152,16.950001,4,,,,,,
61,,Canada,4,,3,72,2,50,3,,,,,,64.099998,1,162,1,24.42,,2,,,,1,,,,,,109,,2,,,,0,,
62,,Canada,5,,1,1956,2,52,3,,,,,,,,,,,,,,,,4,,,,,,NA,,4,80.099998,167.60001,28.52,0,,
63,,Canada,2,,6,37,2,33,3,,,2,,,,,160,1,,,,,,,4,,,,,,NA,,5,,,,2.25,,
64,,Canada,2,,2,37,1,2,4,,,,,,,,,,,,,,,,,,,,,,NA,,3,13.5,,,,,
65,,Canada,9,,6,614,1,52,3,,,,,,82.949997,1,187,1,23.719999,,2,,,,4,,,,,,1395,,4,,,,3,,
66,,Canada,4,,5,4065,2,29,3,,,,,,52.75,1,161,1,20.35,,2,,,,4,,,,,,6174,,2,,,,1.533,,
67,,Canada,2,,3,247,2,41,3,,,,,,60.549999,1,163,1,22.790001,,2,,,,4,,,,,,291,,2,,,,2,,
68,,Canada,10,,4,358,1,50,3,,,,,,78.650002,1,187,1,22.49,,2,,,,4,,,,,,434,,2,,,,10.5,,
69,,Canada,1,,2,498,1,18,4,,,,,,52.450001,1,178.5,1,,,1,,,,1,,,,,,496,16.459999,4,,,,3,,
70,,Canada,5,,4,1884,2,25,3,,,,,,50.099998,1,154,1,21.120001,,2,,,,4,,,,,,2002,,2,,,,9,,
71,,Canada,8,,3,1010,1,73,2,,,,,,85.040001,1,175.5,1,27.610001,,3,,,,4,,,,,,1612,,2,,,,2.25,,
72,,Canada,10,,1,1251,1,60,4,,,,,,,,,,,,,,,,1,,,,,,NA,,1,58.5,180.3,18,.75,,
73,,Canada,4,,4,145,1,45,3,,,,,,134.7,1,185,1,39.360001,,4,,,,4,,,,,,265,,3,,,,11.25,,
74,,Canada,9,,5,1181,1,47,3,,,,,,,,,,,,,,,,4,,,,,,NA,,3,94.5,185.39999,27.49,6,,
75,,Canada,5,,3,1155,1,34,3,,,,,,84,1,185,1,24.540001,,2,,,,4,,,,,,1614,,3,,,,3,,
76,,Canada,3,,2,862,2,55,2,,,,,,,,,,,,,,,,4,,,,,,NA,,2,60.75,167.60001,21.629999,2.6830001,,
77,,Canada,9,,1,377,2,23,3,,,,,,59.900002,1,166,1,21.74,,2,,,,4,,,,,,496,,2,,,,3,,
78,,Canada,3,,5,262,2,16,4,,,,,,77.650002,1,168,1,,,3,,,,4,,,,,,365,27.51,3,,,,,12,4
79,,Canada,6,,5,8017,2,62,3,,,,,,77.800003,1,,,,,,,,,4,,,,,,NA,,3,,162.60001,,5.25,,
80,,Canada,2,,4,47,2,71,3,,,,,,57.299999,1,155,1,23.85,,2,,,,4,,,,,,92,,1,,,,4.5,,
81,,Canada,5,,3,4067,1,84,3,,,,,,,,,,,,,,,,4,,,,,,NA,,1,142.39999,165.10001,52.240002,.86699998,,
82,,Canada,10,,1,638,1,79,3,,,,,,72.900002,1,170.5,1,25.08,,3,,,,4,,,,,,818,,2,,,,5.25,,
83,,Canada,1,,6,63,2,12,4,,,,,,40.650002,1,152,1,,,2,,,,4,,,,,,62,17.59,5,,,,,14,5
84,,Canada,5,,6,1363,1,6,4,,,,,,,,,,,,,,,,,,,,,,NA,,3,22.5,104.1,20.76,,13,1.5
85,,Canada,1,,3,1245,1,40,3,,,,,,,,,,,,,,,,4,,,,,,NA,,3,85.5,172.7,28.67,.75,,
86,,Canada,9,,4,2072,2,34,2,,,,,,64.839996,1,163,1,24.4,,2,,,,4,,,,,,5134,,5,,,,14,,
87,,Canada,8,,3,2824,1,40,3,,,,,,110,1,151,1,48.240002,,4,,,,4,,,,,,3417,,3,,,,1.533,,
88,,Canada,10,,6,155,2,49,3,,,,,,,,,,,,,,,,4,,,,,,NA,,1,92.25,165.10001,33.84,1.5,,
89,,Canada,5,,3,2146,2,82,4,,,,,,74.849998,1,150,1,33.27,,4,,,,4,,,,,,3797,,1,,,,0,,
90,,Canada,7,,4,1585,1,56,3,,,,,,99,1,177.5,1,31.42,,4,,,,1,,,,,,2117,,4,,,,2.25,,
91,,Canada,6,,6,1318,2,71,3,,,,,,68,1,161.5,1,26.07,,3,,,,4,,,,,,2680,,2,,,,3.75,,
92,,Canada,3,,1,810,2,27,3,,,,,,79,1,161.5,1,30.290001,,4,,,,4,,,,,,1226,,3,,,,6,,
93,,Canada,6,,2,576,1,32,3,,,,,,68,1,165,1,24.98,,2,,,,4,,,,,,851,,2,,,,5.25,,
94,,Canada,5,,1,651,2,31,3,,,,,,,,,,,,,,,,4,,,,,,NA,,3,76,162.60001,28.75,0,,
95,,Canada,4,,1,886,1,62,2,,,,,,100,1,189,1,27.99,,3,,,,4,,,,,,901,,2,,,,1.5,,
96,,Canada,10,,1,980,1,15,4,,,,,,,,,,,,,,,,4,,,,,,NA,,3,60.75,177.8,19.219999,,16,2.5
97,,Canada,9,,3,416,2,12,4,,,,,,44,1,158,1,,,2,,,,4,,,,,,439,17.629999,4,,,,,7,1
98,,Canada,5,,6,324,1,52,4,,,,,,72.720001,1,170.5,1,25.02,,3,,,,1,,,,,,676,,1,,,,10.5,,
99,,Canada,6,,4,662,2,61,2,,,,,,,,,,,,,,,,4,,,,,,NA,,1,59.849998,165.10001,21.959999,3.75,,
100,,Canada,6,,1,2446,2,54,3,,,,,,77.050003,1,155.5,1,31.860001,,4,,,,4,,,,,,2721,,4,,,,4.5,,
101,,Canada,3,,1,1060,2,78,4,,,,,,71.699997,1,155,1,29.84,,3,,,,4,,,,,,1405,,3,,,,5.25,,
102,,Canada,7,,3,730,1,4,4,,,,,,22.25,1,109,1,,,3,,,,,,,,,,900,18.73,3,,,,,,
103,,Canada,7,,5,1043,1,21,3,,,,,,,,,,,,,,,,4,1,,,,,NA,,3,,,,1.517,,
104,,Canada,6,,4,3539,2,24,3,,,,,,58.599998,1,166.5,1,21.139999,,2,,,,4,,,,,,7616,,5,,,,1.5,,
105,,Canada,7,,2,566,1,53,,,,,,,142.39999,1,191,1,39.029999,,4,,,,4,,,,,,1027,,4,,,,0,,
106,,Canada,8,,6,292,2,17,4,,,,,,70.449997,1,154,1,,,4,,,,4,,,,,,325,29.709999,4,,,,,4,5
107,,Canada,10,,2,13309,2,38,3,,,,,,50.299999,1,162.5,1,19.049999,,2,,,,4,,,,,,15167,,3,,,,3,,
108,,Canada,1,,5,345,1,30,3,,,,,,88.699997,1,,,,,,,,,4,,,,,,NA,,3,,167.60001,,1.5,,
109,,Canada,8,,2,133,2,9,4,,,,,,52.299999,1,149.5,1,,,4,,,,,,,,,,176,23.4,3,,,,,13,2
110,,Canada,6,,6,2872,1,3,4,,,,,,13.8,1,95.5,1,,,2,,,,,,,,,,4957,15.13,5,,,,,,
111,,Canada,6,,6,559,2,2,4,,,,,,13,1,96,1,,,2,,,,,,,,,,964,14.11,4,,,,,,
112,,Canada,9,,2,533,1,9,4,,,,,,30.299999,1,134.5,1,,,2,,,,,,,,,,787,16.75,3,,,,,6,2
113,,Canada,3,,4,824,2,12,4,,,,,,,,,,,,,,,,4,,,,,,NA,,5,38.25,152.40001,16.469999,,23,1
114,,Canada,10,,1,557,2,63,2,,,,,,79.400002,1,,,,,,,,,4,,,,,,NA,,2,,165.10001,,3.75,,
115,,Canada,8,,4,7002,1,58,3,,,,,,,,,,,,,,,,4,,,,,,NA,,3,90,177.8,28.469999,4.5,,
116,,Canada,8,,4,90,1,8,4,,,,,,29.4,1,130,1,,,2,,,,,,,,,,153,17.4,5,,,,,10,2
117,,Canada,5,,1,1002,1,75,4,,,,,,95.800003,1,,,,,,,,,4,,,,,,NA,,2,,170.2,,2.6830001,,
118,,Canada,8,,1,1072,2,91,2,,,,,,66.050003,1,156,1,27.139999,,3,,,,4,,,,,,1452,,1,,,,3.75,,
119,,Canada,3,,5,552,2,53,3,,,,,,54.599998,1,164.5,1,20.18,,2,,,,4,,,,,,739,,2,,,,3,,
120,,Canada,1,,4,31,2,13,4,,,,,,68.449997,1,162,1,,,3,,,,4,,,,,,31,26.08,4,,,,,7,2
121,,Canada,6,,6,1280,2,4,4,,,,,,19.700001,1,103.5,1,,,2,,,,,,,,,,2595,18.389999,5,,,,,,
122,,Canada,5,,1,7124,2,36,3,,,,,,,,,,,,,,,,4,,,,,,NA,,3,62,165.10001,22.75,0,,
123,,Canada,10,,4,2123,2,61,3,,,,,,60,1,160,1,23.440001,,2,,,,4,,,,,,4533,,2,,,,0,,
124,,Canada,6,,5,607,1,54,2,,,,,,75,1,170,1,25.950001,,3,,,,1,,,,,,1105,,1,,,,10,,
125,,Canada,6,,5,1947,1,9,4,,,,,,,,139.5,1,,,,,,,,,,,,,NA,,4,,,,,5,4
126,,Canada,3,,1,4426,1,40,3,,,,,,86.5,1,169,1,30.290001,,4,,,,4,,,,,,5713,,3,,,,2.25,,
127,,Canada,4,,1,476,2,34,3,,,,,,69.349998,1,166,1,25.17,,3,,,,4,,,,,,723,,3,,,,0,,
128,,Canada,6,,5,10647,2,54,3,,,,,,,,,,,,,,,,4,,,,,,NA,,4,80.099998,157.5,32.290001,3.75,,
129,,Canada,6,,5,1985,2,84,3,,,,,,54.849998,1,158,1,21.969999,,2,,,,4,,,,,,4034,,1,,,,3.0339999,,
130,,Canada,7,,1,46,2,47,3,,,,,,66.800003,1,158,1,26.76,,3,,,,4,,,,,,54,,3,,,,14,,
131,,Canada,7,,6,161,1,1,4,,,,,,,,,,,,,,,,,,,,,,NA,,4,,,,,,
132,,Canada,7,,5,969,2,90,2,,,,,,55.5,1,,,,,,,,,4,,,,,,NA,,1,,157.5,,1.517,,
133,,Canada,4,,6,26,2,22,3,,,,,,,,,,,,,,,,4,,,,,,NA,,1,98,157.5,39.509998,0,,
134,,Canada,9,,1,464,1,4,4,,,,,,15.85,1,99,1,,,2,,,,,,,,,,504,16.17,3,,,,,,
135,,Canada,6,,1,2217,2,11,4,,,,,,47.25,1,149,1,,,3,,,,,,,,,,2645,21.280001,4,,,,,11,3
136,,Canada,7,,2,755,2,39,3,,,,,,104.95,1,167,1,37.630001,,4,,,,4,,,,,,864,,5,,,,.75,,
137,,Canada,9,,3,905,1,8,4,,,,,,40.75,1,132,1,,,4,,,,,,,,,,1075,23.389999,5,,,,,19,3
138,,Canada,5,,6,2785,1,38,3,,,,,,80.349998,1,180,1,24.799999,,2,,,,4,,,5,,,3893,,5,,,,2.6830001,,
139,,Canada,6,,5,1847,2,50,3,,,,,,82,1,162.5,1,31.049999,,4,,,,4,,,,,,3976,,1,,,,10,,
140,,Canada,9,,6,1018,2,28,3,,,2,,,61.5,1,176.5,1,19.74,,2,,,,4,,,,,,1396,,3,,,,2.6830001,,
141,,Canada,7,,3,60,2,73,3,,,,,,,,,,,,,,,,4,,,,,,NA,,1,61.650002,154.90001,25.690001,1.517,,
142,,Canada,2,,1,51,2,45,3,,,,,,80,1,162,1,30.48,,4,,,,4,,,,,,51,,4,,,,.75,,
143,,Canada,2,,1,36,1,3,4,,,,,,15.15,1,98.5,1,,,2,,,,,,,,,,83,15.61,4,,,,,,
144,,Canada,6,,3,2804,2,55,3,,,,,,,,,,,,,,,,4,,,,,,NA,,1,96.75,170.2,33.400002,1.15,,
145,,Canada,8,,1,366,1,31,2,,,,,,101.25,1,174.5,1,33.25,,4,,,,1,,,,,,442,,2,,,,3,,
146,,Canada,2,,5,124,1,37,3,,,,,,73.099998,1,177.5,1,23.200001,,2,,,,4,,,,,,189,,3,,,,7.5,,
147,,Canada,7,,4,381,1,22,3,,,,,,,,,,,,,,,,1,,,,,,NA,,3,108,188,30.559999,4.5,,
148,,Canada,6,,4,789,1,1,4,,,,,,,,,,,,,,,,,,,,,,NA,,3,,,,,,
149,,Canada,6,,2,915,1,35,3,,,,,,77.599998,1,181,1,23.690001,,2,,,,4,,,,,,2043,,3,,,,4,,
150,,Canada,6,,3,742,2,44,4,,,,,,,,,,,,,,,,1,,,,,,NA,,1,54.450001,165.10001,19.98,14,,
151,,Canada,9,,4,319,1,30,3,,,,,,92.199997,1,179.5,1,28.620001,,3,,,,4,,,,,,305,,4,,,,0,,
152,,Canada,3,,6,75,2,47,2,,,,,,84,1,160,1,32.810001,,4,,,,4,,,,,,99,,1,,,,5.25,,
153,,Canada,8,,6,2949,1,43,3,,,,,,102.1,1,167,1,36.610001,,4,,,,4,,,,,,3568,,4,,,,3,,
154,,Canada,6,,4,1020,1,87,4,,,,,,,,,,,,,,,,4,,,,,,NA,,1,65.25,180.3,20.07,0,,
155,,Canada,2,,1,243,2,69,3,,,,,,,,,,,,,,,,4,,,5,,,NA,,2,83.25,157.5,33.560001,0,,
156,,Canada,8,,2,25,2,27,3,,,,,,54,1,160,1,21.09,,2,,,,4,,,,,,27,,1,,,,2.25,,
157,,Canada,6,,5,2513,1,10,4,,,,,,,,,,,,,,,,,,,,,,NA,,5,31.5,116.8,23.09,,14,4
158,,Canada,8,,6,2554,2,25,3,,,,,,70,1,,,,,,,,,4,,,,,,NA,,2,,,,2.25,,
159,,Canada,5,,6,1353,1,52,3,,,,,,125.6,1,173,1,41.970001,,4,,,,4,,,,,,1835,,4,,,,1.9170001,,
160,,Canada,5,,5,1443,1,15,4,,,,,,56.400002,1,178,1,,,2,,,,4,,,,,,1592,17.799999,2,,,,,18,3
161,,Canada,3,,5,72,2,76,3,,,,,,84.099998,1,171.5,1,28.59,,3,,,,4,,,,,,140,,1,,,,5.25,,
162,,Canada,3,,3,183,2,11,4,,,,,,35.950001,1,149.5,1,,,2,,,,,,,,,,199,16.08,4,,,,,11,12
163,,Canada,6,,3,2189,2,4,4,,,,,,20,1,104,1,,,2,,,,,,,,,,2803,18.49,4,,,,,,
164,,Canada,3,,1,996,1,45,3,,,,,,,,,,,,,,,,4,,,,,,NA,,3,52.650002,157.5,21.219999,2.25,,
165,,Canada,6,,3,725,2,75,4,,,,,,81.599998,1,162.5,1,30.9,,4,,,,4,,,,,,1473,,1,,,,0,,
166,,Canada,9,,6,149,2,3,4,,,,,,13.85,1,95.5,1,,,2,,,,,,,,,,252,15.19,5,,,,,,
167,,Canada,3,,4,142,1,9,4,,,,,,30.4,1,135,1,,,2,,,,,,,,,,193,16.68,4,,,,,10,2
168,,Canada,5,,5,703,2,77,4,,,,,,55.5,1,152.5,1,23.860001,,2,,,,4,,,,,,1244,,1,,,,.64999998,,
169,,Canada,6,,5,900,2,10,4,,,,,,44.25,1,155,1,,,2,,,,,,,,,,1005,18.42,4,,,,,,.5
170,,Canada,9,,4,640,2,35,3,,,2,,,82.5,1,171,1,28.209999,,3,,,,4,,,,,,884,,3,,,,0,,
171,,Canada,10,,3,848,2,52,2,,,,,,54.540001,1,157.5,1,21.99,,2,,,,4,1,,,,,1192,,4,,,,0,,
172,,Canada,5,,5,2274,2,40,3,,,,,,72.949997,1,163,1,27.459999,,3,,,,4,,,,,,2991,,3,,,,3,,
173,,Canada,6,,6,456,1,12,4,,,,,,36.5,1,152,1,,,2,,,,4,,,,,,604,15.8,2,,,,,16,1
174,,Canada,6,,2,2812,2,16,4,,,,,,68.099998,1,165,1,,,3,,,,4,,,,,,6288,25.01,5,,,,,0,4
175,,Canada,7,,4,1304,2,56,4,,,,,,77.199997,1,161,1,29.780001,,3,,,,4,,,,,,1954,,4,,,,14,,
176,,Canada,3,,6,129,2,73,3,,,,,,73.300003,1,161.5,1,28.1,,3,,,,4,,,,,,251,,1,,,,7.5,,
177,,Canada,8,,4,268,2,31,3,,,,,,74.550003,1,167.5,1,26.57,,3,,,,1,,,,,,294,,3,,,,2.25,,
178,,Canada,8,,4,506,1,23,2,,,,,,79.949997,1,182,1,24.139999,,2,,,,4,,,,,,799,,2,,,,4,,
179,,Canada,5,,1,8511,1,74,3,,,,,,83.5,1,169,1,29.24,,3,,,,4,,,,,,10389,,3,,,,.75,,
180,,Canada,6,,4,383,2,54,2,,,,,,142.39999,1,164,1,52.939999,,4,,,,4,,,,,,790,,1,,,,0,,
181,,Canada,3,,3,210,1,9,4,,,,,,34.549999,1,138.5,1,,,2,,,,,,,,,,285,18.01,5,,,,,10,1
182,,Canada,10,,2,1150,2,42,3,,,,,,62.75,1,167.5,1,22.370001,,2,,,,4,,,,,,1771,,2,,,,3.75,,
183,,Canada,7,,1,186,2,31,3,,,,,,,,162,1,,,,,,,4,,,,,,NA,,3,,,,0,,
184,,Canada,10,,4,1522,1,67,2,,,,,,92.300003,1,173,1,30.84,,4,,,,4,,,,,,3296,,1,,,,4,,
185,,Canada,6,,3,121,2,21,3,,,,,,,,,,,,,,,,4,,,,,,NA,,1,50,165.10001,18.34,0,,
186,,Canada,9,,6,437,2,1,4,,,,,,,,,,,,,,,,,,,,,,NA,,3,,,,,,
187,,Canada,10,,2,709,2,23,3,,,,,,57.25,1,162,1,21.809999,,2,,,,4,,,5,,,856,,1,,,,0,,
188,,Canada,5,,5,3254,2,45,3,,,,,,75.199997,1,169,1,26.33,,3,,,,4,,,,,,3884,,5,,,,1.5,,
189,,Canada,6,,5,923,2,80,4,,,,,,60,1,155,1,24.969999,,2,,,,4,,,,,,1877,,1,,,,0,,
190,,Canada,10,,1,3283,2,17,4,,,,,,64,1,163,1,,,2,,,,4,,,,,,3385,24.09,5,,,,,10,1.5
191,,Canada,7,,5,431,1,18,2,,,,,,91.599998,1,,,,,,,,,1,,,,,,NA,,4,,185.39999,,10,,
192,,Canada,1,,4,680,1,68,2,,,,,,,,,,,,,,,,4,,,,,,NA,,2,,,,4,,
193,,Canada,5,,1,2964,1,47,3,,,,,,96.400002,1,195.59999,1,25.200001,,3,,,,4,,,,,,3540,,2,,,,10.5,,
194,,Canada,6,,2,1765,1,13,4,,,,,,,,167,1,,,,,,,4,,,,,,NA,,4,,,,,9,1.5
195,,Canada,10,,5,1737,2,36,2,,,,,,63.5,1,165,1,23.32,,2,,,,4,,,,,,3886,,4,,,,1.5,,
196,,Canada,8,,2,155,1,11,4,,,,,,37,1,140.5,1,,,2,,,,,,,5,,,229,18.74,3,,,,,12,2.5
197,,Canada,3,,1,63,1,13,4,,,,,,54.25,1,164,1,,,2,,,,4,,,,,,79,20.17,3,,,,,13,5
198,,Canada,6,,1,3130,1,31,3,,,,,,,,,,,,,,,,4,,,,,,NA,,2,87.75,180.3,26.99,14,,
199,,Canada,1,,2,437,2,72,3,,,,,,,,,,,,,,,,4,,,,,,NA,,2,78.75,157.5,31.75,0,,
200,,Canada,4,,6,616,2,42,3,,,,,,62.5,1,169.5,1,21.75,,2,,,,4,,,,,,935,,4,,,,3,,
201,,Canada,4,,1,723,2,67,4,,,,,,78,1,156,1,32.049999,,4,,,,4,,,,,,928,,2,,,,0,,
202,,Canada,5,,1,455,1,15,4,,,,,,117.35,1,166.5,1,,,4,,,,4,,,,,,502,42.330002,2,,,,,6,6
203,,Canada,8,,5,234,2,11,4,,,,,,28.65,1,133,1,,,2,,,,,,,,,,309,16.200001,4,,,,,15,2
204,,Canada,6,,3,3512,1,6,4,,,,,,38.900002,1,143,1,,,4,,,,,,,,,,4497,19.02,3,,,,,10,3
205,,Canada,10,,3,14313,1,58,3,,,,,,94.199997,1,172.5,1,31.66,,4,,,,4,,,,,,18317,,2,,,,.75,,
206,,Canada,10,,6,560,2,87,4,,,,,,,,,,,,,,,,4,,,5,,,NA,,3,54,142.20001,26.709999,0,,
207,,Canada,9,,6,434,2,47,3,,,,,,80,1,,,,,,,,,4,,,,,,NA,,1,,160,,0,,
208,,Canada,6,,3,1555,2,54,3,,,,,,87.349998,1,168,1,30.950001,,4,,,,4,,,,,,3204,,3,,,,3.75,,
209,,Canada,1,,6,401,1,28,3,,,,,,57.25,1,164.5,1,21.16,,2,,,,1,,,,,,687,,2,,,,2.25,,
210,,Canada,5,,6,1939,2,32,3,,,,,,64,1,168,1,22.68,,2,,,,4,,,,,,2179,,4,,,,3,,
211,,Canada,6,,2,3676,1,46,3,,,,,,70.099998,1,168,1,24.84,,2,,,,4,,,,,,8210,,5,,,,1.734,,
212,,Canada,10,,2,2721,2,66,2,,,,,,,,,,,,,,,,1,,,,,,NA,,2,72,165.10001,26.41,0,,
213,,Canada,9,,5,3759,2,48,3,,,,,,71.349998,1,170,1,24.690001,,2,,,,4,,,,,,4776,,2,,,,3,,
214,,Canada,5,,3,1189,1,39,3,,,,,,95.199997,1,185,1,27.82,,3,,,,1,,,,,,1533,,1,,,,6,,
215,,Canada,5,,3,4279,2,51,3,,,,,,58.099998,1,152,1,25.15,,3,,,,4,,,,,,5141,,2,,,,1.5,,
216,,Canada,9,,3,482,2,21,2,,,,,,64.050003,1,161,1,24.709999,,2,,,,4,,,,,,628,,2,,,,.86699998,,
217,,Canada,10,,2,4689,1,60,3,,,,,,73.5,1,168,1,26.040001,,3,,,,4,,,,,,8943,,1,,,,0,,
218,,Canada,6,,6,561,2,59,3,,,,,,,,,,,,,,,,4,,,,,,NA,,1,61.650002,157.5,24.85,2.6830001,,
219,,Canada,5,,6,3847,2,37,3,,,,,,62.900002,1,164,1,23.389999,,2,,,,4,,,,,,5060,,4,,,,0,,
220,,Canada,9,,2,6582,2,54,2,,,,,,,,,,,,,,,,1,,,,,,NA,,2,,,,0,,
221,,Canada,3,,6,152,2,32,3,,,,,,104,1,179,1,32.459999,,4,,,,1,,,,,,312,,1,,,,0,,
222,,Canada,9,,1,44,1,59,2,,,,,,130.75,1,181.5,1,39.689999,,4,,,,1,,,,,,57,,1,,,,1.517,,
223,,Canada,8,,2,3499,2,53,2,,,,,,,,,,,,,,,,4,,,,,,NA,,2,74.25,165.10001,27.24,14,,
224,,Canada,10,,2,411,1,45,3,,,,,,91.25,1,,,,,,,,,4,,,,,,NA,,1,,177.8,,2.25,,
225,,Canada,3,,6,107,1,15,4,,,,,,79.5,1,,,,,,,,,1,,,,,,NA,,2,,167.60001,,,19,2
226,,Canada,9,,4,13541,2,39,3,,,,,,45.650002,1,155,1,19,,2,,,,4,,,,,,18083,,5,,,,.21699999,,
227,,Canada,3,,1,1290,2,70,3,,,,,,,,157,1,,,,,,,4,,,,,,NA,,2,,,,1.5,,
228,,Canada,1,,2,189,2,89,4,,,,,,55.950001,1,156,1,22.99,,2,,,,4,,,,,,175,,2,,,,0,,
229,,Canada,8,,3,1321,2,85,4,,,,,,70.550003,1,148,1,32.209999,,4,,,,4,,,,,,2613,,1,,,,5.25,,
230,,Canada,4,,2,248,1,82,3,,,,,,92,1,192,1,24.959999,,2,,,,4,,,,,,271,,2,,,,7.5,,
231,,Canada,2,,1,34,2,6,4,,,,,,22.9,1,122,1,,,2,,,,,,,,,,41,15.39,3,,,,,13,2
232,,Canada,5,,3,8029,2,57,4,,,,,,75.5,1,164,1,28.07,,3,,,,1,,,,,,9648,,1,,,,0,,
233,,Canada,2,,5,190,1,51,2,,,,,,114,1,182,1,34.419998,,4,,,,1,,,,,,305,,1,,,,1.5,,
234,,Canada,3,,1,82,2,25,2,,,,,,134.5,1,,,,,,,,,1,,,,,,NA,,1,,165.10001,,0,,
235,,Canada,4,,4,697,2,58,3,,,,,,,,,,,,,,,,4,,,,,,NA,,2,61.650002,157.5,24.85,2.25,,
236,,Canada,4,,2,477,1,29,3,,,,,,78.150002,1,175,1,25.52,,3,,,,4,,,,,,551,,3,,,,8,,
237,,Canada,9,,6,3999,2,49,2,,,,,,120,1,170,1,41.52,,4,,,,4,,,,,,5267,,2,,,,.21699999,,
238,,Canada,7,,2,382,2,17,4,,,,,,90.300003,1,168,1,,,4,,,,4,,,,,,408,31.99,4,,,,,9,7.5
239,,Canada,4,,6,530,2,14,4,,,,,,41.849998,1,151,1,,,2,,,,4,,,,,,656,18.35,5,,,,,6,2.5
240,,Canada,8,,2,230,1,17,4,,,,,,74.400002,1,169,1,,,3,,,,4,,,,,,302,26.049999,5,,,,,24,2
241,,Canada,10,,6,1140,1,76,4,,,,,,,,,,,,,,,,4,,,,,,NA,,2,76.5,180.3,23.530001,7.5,,
242,,Canada,5,,4,1764,1,33,3,,,,,,78,1,175.5,1,25.32,,3,,,,4,,,,,,3499,,3,,,,0,,
243,,Canada,4,,2,321,1,34,2,,,,,,99.300003,1,,,,,,,,,4,,,,,,NA,,2,,182.89999,,1.5,,
244,,Canada,8,,1,201,2,14,4,,,,,,,,172,1,,,,,,,4,,,,,,NA,,2,,,,,2,12
245,,Canada,9,,5,1635,2,9,4,,,,,,26,1,133,1,,,2,,,,,,,,,,1741,14.7,4,,,,,15,1
246,,Canada,1,,5,1210,2,5,4,,,,,,22.75,1,118.49999,1,,,2,,,,,,,,,,1400,16.200001,5,,,,,,
247,,Canada,2,,3,152,2,8,4,,,,,,26.049999,1,127,1,,,2,,,,,,,,,,203,16.15,5,,,,,12,.5
248,,Canada,10,,1,862,1,2,4,,,,,,,,,,,,,,,,,,,,,,NA,,3,13,94,14.71,,,
249,,Canada,10,,6,384,1,10,4,,,,,,42.5,1,153,1,,,2,,,,,,,,,,385,18.16,4,,,,,10,3
250,,Canada,9,,6,1734,2,51,3,,,,,,47.25,1,147,1,21.870001,,2,,,,4,,,,,,2758,,3,,,,2.6830001,,
251,,Canada,10,,6,427,2,82,,,,,,,68.25,1,,,,,,,,,1,,,,,,NA,,1,,152.40001,,0,,
252,,Canada,8,,4,507,2,72,4,,,,,,,,150,1,,,,,,,4,,,5,,,NA,,1,,,,2,,
253,,Canada,8,,3,338,1,36,4,,,,,,89.050003,1,169,1,31.18,,4,,,,4,,,,,,410,,3,,,,3.0339999,,
254,,Canada,6,,6,1250,2,35,2,,,,,,,,167,1,,,,,,,1,,,,,,NA,,5,,,,3,,
255,,Canada,6,,4,1148,2,57,3,,,,,,,,,,,,,,,,4,,,,,,NA,,4,58.5,157.5,23.58,.75,,
256,,Canada,5,,6,1246,1,56,4,,,,,,,,,,,,,,,,4,,,,,,NA,,4,105.75,180.3,32.529999,3,,
257,,Canada,5,,5,703,2,92,3,,,,,,,,,,,,,,,,4,,,,,,NA,,1,67.5,172.7,22.629999,0,,
258,,Canada,6,,6,952,1,32,2,,,,,,,,,,,,,,,,4,,,,,,NA,,2,77,180.3,23.690001,5.25,,
259,,Canada,1,,2,569,2,67,3,,,,,,78.099998,1,164.5,1,28.860001,,3,,,,4,,,,,,848,,2,,,,7.585,,
260,,Canada,6,,4,248,2,88,2,,,,,,,,,,,,,,,,4,,,,,,NA,,1,,162.60001,,0,,
261,,Canada,9,,6,4164,1,7,4,,,,,,23.049999,1,119.00001,1,,,2,,,,,,,,,,5558,16.280001,5,,,,,6,2
262,,Canada,5,,1,3851,2,36,3,,,,,,80.849998,1,172,1,27.33,,3,,,,4,,,,,,4255,,5,,,,3.75,,
263,,Canada,6,,3,1122,1,77,4,,,,,,56.700001,1,153.5,1,24.059999,,2,,,,4,,,,,,2323,,1,,,,10,,
264,,Canada,7,,4,49,2,2,4,,,,,,12.5,1,91,1,,,2,,,,,,,,,,78,15.09,5,,,,,,
265,,Canada,6,,5,2306,1,42,3,,,,,,,,168,1,,,,,,,4,,,,,,NA,,4,,,,.433,,
266,,Canada,7,,4,1147,1,51,3,,,,,,64.699997,1,166,1,23.48,,2,,,,1,,,,,,1532,,5,,,,0,,
267,,Canada,7,,3,696,1,7,4,,,,,,,,,,,,,,,,,,,,,,NA,,5,23.85,121.9,16.049999,,,2
268,,Canada,6,,6,286,2,17,2,,,,,,49.400002,1,157.5,1,,,2,,,,4,,,,,,399,19.91,4,,,,,3,10
269,,Canada,10,,5,1194,1,11,4,,,,,,51.650002,1,153.5,1,,,3,,,,,,,,,,1359,21.92,5,,,,,12,2
270,,Canada,7,,5,356,2,11,4,,,,,,35.049999,1,147,1,,,2,,,,,1,,,,,565,16.219999,4,,,,,8,6
271,,Canada,6,,5,2473,2,18,2,,,,,,46.5,1,150.5,1,,,2,,,,4,,,,,,5529,20.530001,4,,,,1.533,,
272,,Canada,1,,4,841,2,4,4,,,,,,20.200001,1,112,1,,,2,,,,,,,,,,1400,16.1,4,,,,,,
273,,Canada,4,,1,132,1,43,3,,,,,,97.5,1,176.5,1,31.299999,,4,,,,4,,,,,,180,,3,,,,1.5,,
274,,Canada,10,,4,660,2,3,4,,,,,,,,,,,,,,,,,,,,,,NA,,3,16.65,99.099998,16.950001,,,
275,,Canada,8,,6,73,2,11,4,,,,,,60.799999,1,157.5,1,,,4,,,,,,,,,,91,24.51,3,,,,,19,2
276,,Canada,10,,6,1366,2,53,2,,,,,,61,1,161,1,23.530001,,2,,,,4,,,,,,2915,,3,,,,6,,
277,,Canada,6,,1,5601,2,66,3,,,,,,74,1,162.5,1,28.02,,3,,,,4,,,,,,11538,,1,,,,1.5,,
278,,Canada,10,,3,4563,1,45,3,,,,,,73.650002,1,176,1,23.780001,,2,,,,4,,,,,,4943,,4,,,,4.5,,