id,hh_id,country,sec_area,tert_area,round,smpl_weight,sex,age,edc_level,edc,residence,preg_lact,breastfeeding,hh_head,wgt,wgt_method,hgt,hgt_method,bmi_adults,bmi_children,bmi_cat,misrep,pa,pa_cat,smok,special_diet,special_diet_other,clin_diet,clin_diet_other,note,bmi_chld
32239,,Romania,13,,,,2,42,3,4,,,,,56,1,158,1,22.432302,,2,,,,,0,,0,,,
32240,,Romania,13,,,,2,40,3,4,,,,,76,1,170,1,26.297577,,3,,,,,0,,6,Diet related to health condition (condition unspecified),,
32241,,Romania,13,,,,2,70,2,3,,,,,68,1,165,1,24.977043,,2,,,,,0,,6,Diet related to health condition (condition unspecified),,
32242,,Romania,13,,,,2,58,2,3,,,,,103,1,162,1,39.247066,,4,,,,,0,,0,,,
32243,,Romania,13,,,,2,26,3,4,,,,,72,1,169,1,25.209202,,3,,,,,0,,0,,,
32244,,Romania,13,,,,2,26,3,4,,,,,60,1,170,1,20.761246,,2,,,,,0,,0,,,
32245,,Romania,13,,,,2,79,3,4,,,,,72,1,165,1,26.446281,,3,,,,,0,,0,,,
32246,,Romania,13,,,,2,34,2,3,,,,,58,1,162,1,22.10029,,2,,,,,0,,0,,,
32247,,Romania,13,,,,2,54,3,4,,,,,55,1,152,1,23.805401,,2,,,,,0,,0,,,
32248,,Romania,13,,,,2,38,3,4,,,,,68,1,175,1,22.204082,,2,,,,,0,,0,,,
32249,,Romania,13,,,,2,60,3,4,,,,,80,1,170,1,27.681662,,3,,,,,0,,6,Diet related to health condition (condition unspecified),,
32250,,Romania,13,,,,2,40,2,3,,,,,70,1,170,1,24.221453,,2,,,,,0,,0,,,
32251,,Romania,13,,,,2,27,3,4,,,,,67,1,175,1,21.87755,,2,,,,,0,,0,,,
32252,,Romania,13,,,,1,42,2,3,,,,,97,1,178,1,30.61482,,4,,,,,0,,0,,,
32253,,Romania,13,,,,1,57,2,3,,,,,103,1,171,1,35.224514,,4,,,,,0,,6,Diet related to health condition (condition unspecified),,
32254,,Romania,13,,,,1,25,3,4,,,,,55,1,180,1,16.975309,,1,,,,,0,,0,,,
32255,,Romania,13,,,,1,26,3,4,,,,,80,1,180,1,24.691359,,2,,,,,0,,0,,,
32256,,Romania,13,,,,1,36,3,4,,,,,65,1,178,1,20.515087,,2,,,,,0,,0,,,
32257,,Romania,13,,,,1,25,3,4,,,,,60,1,175,1,19.591837,,2,,,,,0,,0,,,
32258,,Romania,13,,,,1,36,3,4,,,,,62,1,180,1,19.135803,,2,,,,,0,,0,,,
32259,,Romania,13,,,,1,40,3,4,,,,,75,1,182,1,22.642193,,2,,,,,0,,0,,,
32260,,Romania,13,,,,1,45,3,4,,,,,75,1,180,1,23.148148,,2,,,,,0,,0,,,
32261,,Romania,13,,,,1,38,2,3,,,,,65,1,170,1,22.49135,,2,,,,,0,,0,,,
32262,,Romania,13,,,,1,47,2,3,,,,,69,1,173,1,23.054562,,2,,,,,0,,0,,,
32263,,Romania,13,,,,1,47,2,3,,,,,74,1,174,1,24.441803,,2,,,,,0,,0,,,
32264,,Romania,13,,,,1,43,2,3,,,,,64,1,171,1,21.887075,,2,,,,,0,,0,,,
32265,,Romania,13,,,,1,62,2,2,,,,,69,1,165,1,25.344353,,3,,,,,0,,6,Diet related to health condition (condition unspecified),,
32266,,Romania,13,,,,1,79,2,2,,,,,82,1,167,1,29.402273,,3,,,,,0,,0,,,
32267,,Romania,13,,,,1,32,2,3,,,,,68,1,173,1,22.720438,,2,,,,,0,,0,,,
32268,,Romania,13,,,,1,52,2,3,,,,,58,1,173,1,19.379198,,2,,,,,0,,0,,,
32269,,Romania,13,,,,1,68,2,2,,,,,72,1,178,1,22.724403,,2,,,,,0,,0,,,
32270,,Romania,13,,,,2,45,2,2,,,,,80,1,167,1,28.685144,,3,,,,,0,,0,,,
32271,,Romania,13,,,,2,28,2,3,,,,,60,1,167,1,21.513859,,2,,,,,0,,0,,,
32272,,Romania,13,,,,2,38,3,4,,,,,66,1,170,1,22.83737,,2,,,,,0,,0,,,
32273,,Romania,13,,,,2,45,2,3,,,,,58,1,165,1,21.303949,,2,,,,,0,,0,,,
32274,,Romania,13,,,,2,31,3,4,,,,,52,1,162,1,19.814053,,2,,,,,0,,0,,,
32275,,Romania,13,,,,2,28,2,3,,,,,60,1,165,1,22.038567,,2,,,,,0,,0,,,
32276,,Romania,13,,,,2,86,2,2,,,,,57,1,150,1,25.333334,,3,,,,,0,,6,Diet related to health condition (condition unspecified),,
32277,,Romania,13,,,,2,20,2,3,,,,,50,1,165,1,18.365473,,1,,,,,0,,0,,,
32278,,Romania,13,,,,2,43,2,3,,,,,85,1,165,1,31.221304,,4,,,,,0,,0,,,
32279,,Romania,15,,,,1,59,2,2,,,,,94,1,174,1,31.047695,,4,,,,,0,,0,,,
32280,,Romania,15,,,,1,42,2,2,,,,,92,1,182,1,27.774424,,3,,,,,0,,0,,,
32281,,Romania,15,,,,1,25,3,4,,,,,84,1,190,1,23.268698,,2,,,,,0,,6,Diet related to health condition (condition unspecified),,
32282,,Romania,15,,,,1,48,2,2,,,,,72,1,168,1,25.510204,,3,,,,,0,,0,,,
32283,,Romania,15,,,,1,39,2,3,,,,,99,1,180,1,30.555555,,4,,,,,0,,0,,,
32284,,Romania,15,,,,1,66,2,2,,,,,70,1,165,1,25.711662,,3,,,,,0,,6,Diet related to health condition (condition unspecified),,
32285,,Romania,15,,,,1,56,2,2,,,,,100,1,175,1,32.653061,,4,,,,,0,,0,,,
32286,,Romania,15,,,,1,71,2,3,,,,,70,1,174,1,23.120625,,2,,,,,0,,6,Diet related to health condition (condition unspecified),,
32287,,Romania,15,,,,2,61,2,3,,,,,84,1,170,1,29.065744,,3,,,,,0,,0,,,
32288,,Romania,15,,,,2,57,2,3,,,,,74,1,168,1,26.218821,,3,,,,,0,,0,,,
32289,,Romania,15,,,,2,65,2,2,,,,,72,1,167,1,25.816629,,3,,,,,0,,0,,,
32290,,Romania,15,,,,2,70,2,2,,,,,90,1,172,1,30.42185,,4,,,,,0,,6,Diet related to health condition (condition unspecified),,
32291,,Romania,15,,,,2,32,2,3,,,,,65,1,160,1,25.390625,,3,,,,,0,,0,,,
32292,,Romania,15,,,,2,63,2,3,,,,,54,1,167,1,19.362473,,2,,,,,0,,6,Diet related to health condition (condition unspecified),,
32293,,Romania,15,,,,2,51,2,3,,,,,78,1,165,1,28.650137,,3,,,,,0,,0,,,
32294,,Romania,15,,,,2,44,2,3,,,,,82,1,165,1,30.119375,,4,,,,,0,,0,,,
32295,,Romania,15,,,,2,35,3,4,,,,,62,1,160,1,24.21875,,2,,,,,0,,0,,,
32296,,Romania,15,,,,2,37,2,3,,,,,67,1,165,1,24.609734,,2,,,,,0,,0,,,
32297,,Romania,15,,,,2,61,2,2,,,,,75,1,162,1,28.577961,,3,,,,,0,,0,,,
32298,,Romania,15,,,,2,51,2,3,,,,,76,1,162,1,28.959,,3,,,,,0,,0,,,
32299,,Romania,15,,,,2,33,2,3,,,,,65,1,166,1,23.588329,,2,,,,,0,,0,,,
32300,,Romania,15,,,,2,46,2,3,,,,,96,1,165,1,35.261707,,4,,,,,0,,0,,,
32301,,Romania,15,,,,2,50,2,3,,,,,69,1,167,1,24.740938,,2,,,,,0,,0,,,
32302,,Romania,15,,,,2,71,2,3,,,,,64,1,161,1,24.690405,,2,,,,,0,,0,,,
32303,,Romania,15,,,,2,72,2,3,,,,,59,1,158,1,23.634033,,2,,,,,0,,0,,,
32304,,Romania,15,,,,2,45,3,4,,,,,61,1,160,1,23.828125,,2,,,,,0,,0,,,
32305,,Romania,15,,,,2,26,2,3,,,,,78,1,172,1,26.365602,,3,,,,,0,,0,,,
32306,,Romania,15,,,,2,41,2,3,,,,,84,1,165,1,30.853994,,4,,,,,0,,0,,,
32307,,Romania,15,,,,2,52,2,3,,,,,64,1,168,1,22.675737,,2,,,,,0,,0,,,
32308,,Romania,15,,,,1,60,2,3,,,,,92,1,180,1,28.395061,,3,,,,,0,,0,,,
32309,,Romania,15,,,,1,60,2,2,,,,,85,1,172,1,28.731747,,3,,,,,0,,6,Diet related to health condition (condition unspecified),,
32310,,Romania,15,,,,1,60,2,3,,,,,112,1,174,1,36.992996,,4,,,,,0,,6,Diet related to health condition (condition unspecified),,
32311,,Romania,15,,,,1,30,3,4,,,,,72,1,170,1,24.913494,,2,,,,,0,,0,,,
32312,,Romania,15,,,,1,32,3,4,,,,,82,1,175,1,26.775511,,3,,,,,0,,0,,,
32313,,Romania,15,,,,1,61,2,3,,,,,83,1,179,1,25.90431,,3,,,,,0,,0,,,
32314,,Romania,15,,,,1,29,2,2,,,,,84,1,172,1,28.393726,,3,,,,,0,,0,,,
32315,,Romania,15,,,,1,43,2,3,,,,,67,1,167,1,24.023809,,2,,,,,0,,0,,,
32316,,Romania,15,,,,1,34,2,3,,,,,90,1,170,1,31.141869,,4,,,,,0,,0,,,
32317,,Romania,15,,,,1,42,2,3,,,,,86,1,170,1,29.757786,,3,,,,,0,,0,,,
32318,,Romania,15,,,,1,41,3,4,,,,,95,1,178,1,29.983587,,3,,,,,0,,0,,,
32319,,Romania,20,,,,2,31,2,3,,,,,50,1,163,1,18.818924,,2,,,,,0,,0,,,
32320,,Romania,2,,,,1,44,2,3,,,,,82,1,181,1,25.02976,,3,,,,,0,,0,,,
32321,,Romania,2,,,,1,39,2,3,,,,,104,1,185,1,30.387144,,4,,,,,0,,0,,,
32322,,Romania,2,,,,1,56,3,4,,,,,92,1,174,1,30.387106,,4,,,,,0,,6,Diet related to health condition (condition unspecified),,
32323,,Romania,2,,,,1,42,2,3,,,,,96,1,196,1,24.989588,,2,,,,,0,,0,,,
32324,,Romania,2,,,,1,46,3,4,,,,,80,1,179,1,24.96801,,2,,,,,0,,0,,,
32325,,Romania,2,,,,1,40,2,3,,,,,90,1,183,1,26.874496,,3,,,,,0,,0,,,
32326,,Romania,2,,,,1,33,3,4,,,,,68,1,175,1,22.204082,,2,,,,,0,,0,,,
32327,,Romania,2,,,,1,25,3,4,,,,,80,1,175,1,26.12245,,3,,,,,0,,0,,,
32328,,Romania,2,,,,1,38,3,4,,,,,88,1,178,1,27.774271,,3,,,,,0,,0,,,
32329,,Romania,2,,,,1,48,3,4,,,,,84,1,174,1,27.744749,,3,,,,,0,,6,Diet related to health condition (condition unspecified),,
32330,,Romania,2,,,,1,38,3,4,,,,,65,1,170,1,22.49135,,2,,,,,0,,0,,,
32331,,Romania,2,,,,2,36,2,3,,,,,90,1,175,1,29.387754,,3,,,,,0,,0,,,
32332,,Romania,2,,,,2,47,3,4,,,,,52,1,159,1,20.568806,,2,,,,,0,,0,,,
32333,,Romania,2,,,,2,39,3,4,,,,,80,1,167,1,28.685144,,3,,,,,0,,0,,,
32334,,Romania,2,,,,2,37,2,3,,,,,65,1,163,1,24.464602,,2,,,,,0,,0,,,
32335,,Romania,2,,,,2,46,3,4,,,,,64,1,167,1,22.948116,,2,,,,,0,,0,,,
32336,,Romania,2,,,,2,38,3,4,,,,,55,1,168,1,19.486961,,2,,,,,0,,0,,,
32337,,Romania,2,,,,2,50,3,4,,,,,61,1,168,1,21.612812,,2,,,,,0,,0,,,
32338,,Romania,2,,,,2,35,3,4,,,,,58,1,160,1,22.65625,,2,,,,,0,,0,,,
32339,,Romania,2,,,,2,56,2,3,,,,,76,1,164,1,28.25699,,3,,,,,0,,0,,,
32340,,Romania,2,,,,2,58,2,3,,,,,66,1,165,1,24.242424,,2,,,,,0,,0,,,
32341,,Romania,2,,,,2,47,2,3,,,,,70,1,165,1,25.711662,,3,,,,,0,,0,,,
32342,,Romania,2,,,,2,40,3,4,,,,,53,1,165,1,19.467402,,2,,,,,0,,0,,,
32343,,Romania,2,,,,2,39,1,1,,,,,87,1,170,1,30.103806,,4,,,,,0,,0,,,
32344,,Romania,2,,,,2,46,2,3,,,,,100,1,169,1,35.012779,,4,,,,,0,,0,,,
32345,,Romania,2,,,,2,71,2,3,,,,,63,1,168,1,22.321428,,2,,,,,0,,0,,,
32346,,Romania,2,,,,2,36,3,4,,,,,72,1,168,1,25.510204,,3,,,,,0,,0,,,
32347,,Romania,2,,,,2,55,1,1,,,,,98,1,170,1,33.910034,,4,,,,,0,,0,,,
32348,,Romania,2,,,,2,52,2,3,,,,,85,1,170,1,29.411764,,3,,,,,0,,0,,,
32349,,Romania,2,,,,2,33,2,3,,,,,73,1,168,1,25.864513,,3,,,,,0,,0,,,
32350,,Romania,2,,,,2,25,3,4,,,,,70,1,168,1,24.801588,,2,,,,,0,,0,,,
32351,,Romania,2,,,,2,38,3,4,,,,,69,1,161,1,26.619343,,3,,,,,0,,0,,,
32352,,Romania,2,,,,1,43,3,4,,,,,70,1,174,1,23.120625,,2,,,,,0,,0,,,
32353,,Romania,2,,,,1,47,2,3,,,,,78,1,180,1,24.074074,,2,,,,,0,,0,,,
32354,,Romania,2,,,,1,51,2,2,,,,,70,1,178,1,22.09317,,2,,,,,0,,0,,,
32355,,Romania,2,,,,1,43,2,2,,,,,90,1,170,1,31.141869,,4,,,,,0,,0,,,
32356,,Romania,2,,,,1,76,2,2,,,,,84,1,160,1,32.8125,,4,,,,,0,,6,Diet related to health condition (condition unspecified),,
32357,,Romania,2,,,,1,30,3,4,,,,,110,1,190,1,30.470915,,4,,,,,0,,0,,,
32358,,Romania,2,,,,1,33,2,3,,,,,93,1,182,1,28.076319,,3,,,,,0,,0,,,
32359,,Romania,2,,,,1,55,2,3,,,,,98,1,180,1,30.246914,,4,,,,,0,,0,,,
32360,,Romania,20,,,,2,51,2,3,,,,,85,1,160,1,33.203125,,4,,,,,0,,6,Diet related to health condition (condition unspecified),,
32361,,Romania,20,,,,2,75,2,2,,,,,79,1,175,1,25.795918,,3,,,,,0,,6,Diet related to health condition (condition unspecified),,
32362,,Romania,20,,,,2,52,2,3,,,,,69,1,167,1,24.740938,,2,,,,,0,,0,,,
32363,,Romania,20,,,,2,28,2,3,,,,,72,1,163,1,27.099251,,3,,,,,0,,0,,,
32364,,Romania,20,,,,2,28,2,3,,,,,60,1,164,1,22.308149,,2,,,,,0,,0,,,
32365,,Romania,20,,,,2,34,2,3,,,,,85,1,167,1,30.477966,,4,,,,,0,,0,,,
32366,,Romania,20,,,,2,26,2,3,,,,,47,1,160,1,18.359375,,1,,,,,0,,0,,,
32367,,Romania,20,,,,2,24,2,3,,,,,54,1,160,1,21.09375,,2,,,,,0,,0,,,
32368,,Romania,20,,,,2,32,2,2,,,,,55,1,162,1,20.95717,,2,,,,,0,,0,,,
32369,,Romania,20,,,,2,28,2,2,,,,,57,1,160,1,22.265625,,2,,,,,0,,0,,,
32370,,Romania,21,,,,1,61,2,3,,,,,90,1,167,1,32.270786,,4,,,,,0,,0,,,
32371,,Romania,21,,,,1,41,3,4,,,,,102,1,185,1,29.802776,,3,,,,,0,,0,,,
32372,,Romania,21,,,,1,70,2,2,,,,,94,1,170,1,32.525951,,4,,,,,0,,6,Diet related to health condition (condition unspecified),,
32373,,Romania,21,,,,1,59,2,3,,,,,77,1,178,1,24.302486,,2,,,,,0,,0,,,
32374,,Romania,21,,,,1,29,3,4,,,,,79,1,183,1,23.589836,,2,,,,,0,,0,,,
32375,,Romania,21,,,,1,56,2,3,,,,,114,1,185,1,33.308983,,4,,,,,0,,0,,,
32376,,Romania,21,,,,1,43,3,4,,,,,82,1,183,1,24.485653,,2,,,,,0,,6,Diet related to health condition (condition unspecified),,
32377,,Romania,21,,,,1,60,2,3,,,,,87,1,174,1,28.735632,,3,,,,,0,,6,Diet related to health condition (condition unspecified),,
32378,,Romania,21,,,,1,52,3,4,,,,,96,1,182,1,28.982006,,3,,,,,0,,0,,,
32379,,Romania,21,,,,1,65,3,4,,,,,73,1,176,1,23.566631,,2,,,,,0,,0,,,
32380,,Romania,21,,,,1,31,3,4,,,,,70,1,168,1,24.801588,,2,,,,,0,,0,,,
32381,,Romania,21,,,,1,45,2,3,,,,,90,1,185,1,26.296566,,3,,,,,0,,0,,,
32382,,Romania,21,,,,1,45,2,3,,,,,68.5,1,175,1,22.367348,,2,,,,,0,,0,,,
32383,,Romania,21,,,,1,43,2,3,,,,,100,1,176,1,32.283058,,4,,,,,0,,0,,,
32384,,Romania,21,,,,1,34,2,3,,,,,94,1,173,1,31.407665,,4,,,,,0,,0,,,
32385,,Romania,21,,,,1,43,2,3,,,,,66,1,171,1,22.571047,,2,,,,,0,,0,,,
32386,,Romania,21,,,,1,35,2,3,,,,,89,1,170,1,30.795847,,4,,,,,0,,0,,,
32387,,Romania,21,,,,1,32,2,3,,,,,84,1,177,1,26.81222,,3,,,,,0,,0,,,
32388,,Romania,21,,,,1,59,2,3,,,,,58.5,1,165,1,21.487604,,2,,,,,0,,0,,,
32389,,Romania,21,,,,2,40,2,3,,,,,80,1,162,1,30.483158,,4,,,,,0,,0,,,
32390,,Romania,21,,,,2,42,3,4,,,,,57,1,164,1,21.192743,,2,,,,,0,,0,,,
32391,,Romania,21,,,,2,44,2,3,,,,,89,1,167,1,31.912224,,4,,,,,0,,0,,,
32392,,Romania,21,,,,2,71,2,2,,,,,70,1,155,1,29.136316,,3,,,,,0,,0,,,
32393,,Romania,21,,,,2,33,2,3,,,,,80,1,170,1,27.681662,,3,,,,,0,,0,,,
32394,,Romania,21,,,,2,28,2,3,,,,,64,1,168,1,22.675737,,2,,,,,0,,0,,,
32395,,Romania,21,,,,2,55,2,3,,,,,82,1,164,1,30.487804,,4,,,,,0,,0,,,
32396,,Romania,21,,,,2,35,3,4,,,,,63,1,165,1,23.140495,,2,,,,,0,,0,,,
32397,,Romania,21,,,,2,32,2,3,,,,,54,1,166,1,19.596458,,2,,,,,0,,0,,,
32398,,Romania,21,,,,2,67,2,2,,,,,88,1,165,1,32.323231,,4,,,,,0,,6,Diet related to health condition (condition unspecified),,
32399,,Romania,21,,,,2,36,2,3,,,,,82,1,175,1,26.775511,,3,,,,,0,,0,,,
32400,,Romania,21,,,,2,46,2,3,,,,,71,1,162,1,27.053802,,3,,,,,0,,0,,,
32401,,Romania,21,,,,2,23,2,3,,,,,60,1,170,1,20.761246,,2,,,,,0,,0,,,
32402,,Romania,21,,,,2,58,2,3,,,,,70,1,163,1,26.346495,,3,,,,,0,,6,Diet related to health condition (condition unspecified),,
32403,,Romania,21,,,,2,63,2,2,,,,,76,1,170,1,26.297577,,3,,,,,0,,6,Diet related to health condition (condition unspecified),,
32404,,Romania,21,,,,2,33,3,4,,,,,79,1,167,1,28.32658,,3,,,,,0,,0,,,
32405,,Romania,21,,,,2,45,2,3,,,,,55,1,167,1,19.721037,,2,,,,,0,,0,,,
32406,,Romania,21,,,,2,50,3,4,,,,,62,1,163,1,23.335466,,2,,,,,0,,0,,,
32407,,Romania,21,,,,2,59,2,3,,,,,80,1,163,1,30.110279,,4,,,,,0,,0,,,
32408,,Romania,21,,,,2,29,3,4,,,,,69,1,168,1,24.447279,,2,,,,,0,,0,,,
32409,,Romania,21,,,,2,56,3,4,,,,,67,1,155,1,27.887617,,3,,,,,0,,0,,,
32410,,Romania,11,,,,2,34,3,4,,,,,64,1,164,1,23.795361,,2,,,,,0,,0,,,
32411,,Romania,11,,,,2,23,2,3,,,,,48,1,162,1,18.289894,,1,,,,,0,,0,,,
32412,,Romania,11,,,,2,28,2,3,,,,,70,1,166,1,25.402817,,3,,,,,0,,0,,,
32413,,Romania,11,,,,2,53,2,3,,,,,80,1,169,1,28.010223,,3,,,,,0,,0,,,
32414,,Romania,11,,,,2,32,2,3,,,,,55,1,165,1,20.202021,,2,,,,,0,,0,,,
32415,,Romania,11,,,,2,50,2,3,,,,,105,1,162,1,40.009144,,4,,,,,0,,0,,,
32416,,Romania,11,,,,1,42,2,3,,,,,102,1,180,1,31.481482,,4,,,,,0,,0,,,
32417,,Romania,11,,,,1,60,2,3,,,,,88,1,169,1,30.811247,,4,,,,,0,,0,,,
32418,,Romania,11,,,,1,29,2,3,,,,,78,1,185,1,22.790358,,2,,,,,0,,0,,,
32419,,Romania,11,,,,1,35,2,3,,,,,95,1,185,1,27.757486,,3,,,,,0,,0,,,
32420,,Romania,11,,,,1,31,3,4,,,,,71,1,174,1,23.450918,,2,,,,,0,,0,,,
32421,,Romania,11,,,,2,54,2,3,,,,,86,1,168,1,30.470522,,4,,,,,0,,0,,,
32422,,Romania,11,,,,2,21,2,3,,,,,47,1,162,1,17.908855,,1,,,,,0,,0,,,
32423,,Romania,11,,,,2,74,2,2,,,,,78,1,160,1,30.46875,,4,,,,,0,,6,Diet related to health condition (condition unspecified),,
32424,,Romania,11,,,,2,92,2,2,,,,,56,1,157,1,22.718975,,2,,,,,0,,0,,,
32425,,Romania,11,,,,2,40,2,3,,,,,59,1,166,1,21.410946,,2,,,,,0,,0,,,
32426,,Romania,11,,,,1,80,2,2,,,,,53,1,158,1,21.230572,,2,,,,,0,,6,Diet related to health condition (condition unspecified),,
32427,,Romania,11,,,,1,57,2,2,,,,,91,1,170,1,31.487888,,4,,,,,0,,0,,,
32428,,Romania,11,,,,1,60,2,2,,,,,78,1,169,1,27.309969,,3,,,,,0,,0,,,
32429,,Romania,11,,,,1,41,2,2,,,,,68,1,175,1,22.204082,,2,,,,,0,,0,,,
32430,,Romania,11,,,,2,27,3,4,,,,,70,1,167,1,25.099501,,3,,,,,0,,0,,,
32431,,Romania,11,,,,2,40,2,3,,,,,58,1,160,1,22.65625,,2,,,,,0,,0,,,
32432,,Romania,11,,,,2,44,3,4,,,,,88,1,169,1,30.811247,,4,,,,,0,,6,Diet related to health condition (condition unspecified),,
32433,,Romania,11,,,,2,24,3,4,,,,,52,1,162,1,19.814053,,2,,,,,0,,6,Diet related to health condition (condition unspecified),,
32434,,Romania,11,,,,2,64,2,2,,,,,66,1,160,1,25.78125,,3,,,,,0,,0,,,
32435,,Romania,11,,,,2,73,2,2,,,,,90,1,186,1,26.014568,,3,,,,,0,,0,,,
32436,,Romania,11,,,,1,32,2,3,,,,,96,1,182,1,28.982006,,3,,,,,0,,6,Diet related to health condition (condition unspecified),,
32437,,Romania,11,,,,1,74,2,3,,,,,77,1,179,1,24.03171,,2,,,,,0,,6,Diet related to health condition (condition unspecified),,
32438,,Romania,11,,,,1,51,2,2,,,,,78,1,171,1,26.674875,,3,,,,,0,,0,,,
32439,,Romania,11,,,,1,56,2,3,,,,,105,1,165,1,38.567493,,4,,,,,0,,6,Diet related to health condition (condition unspecified),,
32440,,Romania,11,,,,1,69,3,4,,,,,70,1,169,1,24.508945,,2,,,,,0,,0,,,
32441,,Romania,11,,,,1,48,2,3,,,,,84,1,190,1,23.268698,,2,,,,,0,,0,,,
32442,,Romania,11,,,,2,71,2,2,,,,,58,1,157,1,23.530367,,2,,,,,0,,6,Diet related to health condition (condition unspecified),,
32443,,Romania,11,,,,2,60,2,3,,,,,120,1,187,1,34.316109,,4,,,,,0,,6,Diet related to health condition (condition unspecified),,
32444,,Romania,11,,,,2,39,3,4,,,,,72,1,169,1,25.209202,,3,,,,,0,,0,,,
32445,,Romania,11,,,,2,52,2,3,,,,,89,1,145,1,42.330559,,4,,,,,0,,0,,,
32446,,Romania,11,,,,1,21,2,2,,,,,68,1,172,1,22.985397,,2,,,,,0,,0,,,
32447,,Romania,11,,,,1,48,2,2,,,,,105,1,168,1,37.202381,,4,,,,,0,,0,,,
32448,,Romania,11,,,,1,68,2,3,,,,,87,1,174,1,28.735632,,3,,,,,0,,0,,,
32449,,Romania,11,,,,1,37,2,3,,,,,92,1,189,1,25.755157,,3,,,,,0,,0,,,
32450,,Romania,9,,,,2,35,2,2,,,,,67,1,180,1,20.679012,,2,,,,,0,,0,,,
32451,,Romania,9,,,,2,34,2,2,,,,,67,1,180,1,20.679012,,2,,,,,0,,0,,,
32452,,Romania,9,,,,2,38,3,4,,,,,54,1,165,1,19.834711,,2,,,,,0,,0,,,
32453,,Romania,9,,,,2,82,2,3,,,,,70,1,165,1,25.711662,,3,,,,,0,,0,,,
32454,,Romania,9,,,,2,56,3,4,,,,,69,1,169,1,24.158817,,2,,,,,0,,0,,,
32455,,Romania,9,,,,1,59,2,3,,,,,75,1,169,1,26.259584,,3,,,,,0,,0,,,
32456,,Romania,9,,,,1,56,3,4,,,,,73,1,168,1,25.864513,,3,,,,,0,,0,,,
32457,,Romania,9,,,,2,54,2,3,,,,,80,1,180,1,24.691359,,2,,,,,0,,0,,,
32458,,Romania,9,,,,2,52,3,4,,,,,71,1,161,1,27.390919,,3,,,,,0,,0,,,
32459,,Romania,9,,,,2,51,3,4,,,,,74,1,164,1,27.513386,,3,,,,,0,,0,,,
32460,,Romania,9,,,,2,44,2,3,,,,,65,1,164,1,24.167162,,2,,,,,0,,0,,,
32461,,Romania,9,,,,1,45,3,4,,,,,84,1,176,1,27.117769,,3,,,,,0,,0,,,
32462,,Romania,9,,,,1,36,2,3,,,,,90,1,182,1,27.170631,,3,,,,,0,,0,,,
32463,,Romania,9,,,,1,53,3,4,,,,,76,1,180,1,23.456791,,2,,,,,0,,0,,,
32464,,Romania,9,,,,1,58,3,4,,,,,71,1,175,1,23.183674,,2,,,,,0,,0,,,
32465,,Romania,9,,,,1,38,2,3,,,,,74,1,172,1,25.013521,,3,,,,,0,,6,Diet related to health condition (condition unspecified),,
32466,,Romania,9,,,,1,60,3,4,,,,,72,1,175,1,23.510204,,2,,,,,0,,0,,,
32467,,Romania,9,,,,1,40,2,3,,,,,95,1,177,1,30.323343,,4,,,,,0,,0,,,
32468,,Romania,9,,,,2,35,3,4,,,,,56,1,164,1,20.82094,,2,,,,,0,,0,,,
32469,,Romania,9,,,,2,52,2,3,,,,,77,1,160,1,30.078125,,4,,,,,0,,0,,,
32470,,Romania,9,,,,2,61,2,3,,,,,60,1,157,1,24.341759,,2,,,,,0,,0,,,
32471,,Romania,9,,,,2,34,2,3,,,,,72,1,164,1,26.769779,,3,,,,,0,,0,,,
32472,,Romania,9,,,,1,32,3,4,,,,,77,1,182,1,23.245985,,2,,,,,0,,0,,,
32473,,Romania,9,,,,1,60,2,3,,,,,92,1,178,1,29.036737,,3,,,,,0,,0,,,
32474,,Romania,9,,,,2,58,2,2,,,,,80,1,178,1,25.249338,,3,,,,,0,,0,,,
32475,,Romania,9,,,,2,33,3,4,,,,,60,1,163,1,22.582708,,2,,,,,0,,0,,,
32476,,Romania,9,,,,2,31,3,4,,,,,58,1,168,1,20.549887,,2,,,,,0,,0,,,
32477,,Romania,9,,,,2,31,3,4,,,,,58,1,168,1,20.549887,,2,,,,,0,,0,,,
32478,,Romania,9,,,,2,46,2,3,,,,,95,1,168,1,33.659298,,4,,,,,0,,0,,,
32479,,Romania,9,,,,2,54,2,2,,,,,65,1,159,1,25.711008,,3,,,,,0,,0,,,
32480,,Romania,9,,,,2,70,2,3,,,,,69,1,167,1,24.740938,,2,,,,,0,,0,,,
32481,,Romania,9,,,,1,58,2,2,,,,,56,1,170,1,19.377163,,2,,,,,0,,0,,,
32482,,Romania,9,,,,2,59,2,3,,,,,70,1,167,1,25.099501,,3,,,,,0,,0,,,
32483,,Romania,9,,,,1,64,2,3,,,,,96,1,174,1,31.708284,,4,,,,,0,,6,Diet related to health condition (condition unspecified),,
32484,,Romania,9,,,,1,36,2,3,,,,,80,1,194,1,21.256245,,2,,,,,0,,0,,,
32485,,Romania,9,,,,1,36,2,3,,,,,95,1,187,1,27.16692,,3,,,,,0,,0,,,
32486,,Romania,9,,,,1,69,2,3,,,,,90,1,175,1,29.387754,,3,,,,,0,,6,Diet related to health condition (condition unspecified),,
32487,,Romania,9,,,,1,88,2,2,,,,,90,1,170,1,31.141869,,4,,,,,0,,0,,,
32488,,Romania,9,,,,1,36,3,4,,,,,85,1,189,1,23.795527,,2,,,,,0,,0,,,
32489,,Romania,9,,,,2,58,2,3,,,,,80,1,171,1,27.358845,,3,,,,,0,,0,,,
32490,,Romania,23,,,,1,55,2,3,,,,,81,1,178,1,25.564955,,3,,,,,0,,0,,,
32491,,Romania,23,,,,1,53,3,4,,,,,103,1,175,1,33.632652,,4,,,,,0,,0,,,
32492,,Romania,23,,,,1,64,3,4,,,,,80,1,160,1,31.25,,4,,,,,0,,6,Diet related to health condition (condition unspecified),,
32493,,Romania,23,,,,1,41,2,3,,,,,70,1,172,1,23.661438,,2,,,,,0,,0,,,
32494,,Romania,23,,,,1,41,3,4,,,,,63,1,172,1,21.295294,,2,,,,,0,,0,,,
32495,,Romania,23,,,,2,39,3,4,,,,,75,1,170,1,25.951557,,3,,,,,0,,6,Diet related to health condition (condition unspecified),,
32496,,Romania,23,,,,2,60,2,3,,,,,87,1,165,1,31.955923,,4,,,,,0,,0,,,
32497,,Romania,23,,,,2,54,3,4,,,,,52,1,155,1,21.644121,,2,,,,,0,,0,,,
32498,,Romania,23,,,,2,78,2,2,,,,,67,1,160,1,26.171875,,3,,,,,0,,0,,,
32499,,Romania,23,,,,2,30,3,4,,,,,65,1,160,1,25.390625,,3,,,,,0,,0,,,
32500,,Romania,23,,,,2,49,3,4,,,,,80,1,167,1,28.685144,,3,,,,,0,,0,,,
32501,,Romania,23,,,,2,31,2,3,,,,,57,1,162,1,21.71925,,2,,,,,0,,0,,,
32502,,Romania,23,,,,2,44,2,3,,,,,73,1,164,1,27.141582,,3,,,,,0,,0,,,
32503,,Romania,23,,,,2,52,2,3,,,,,76,1,163,1,28.604765,,3,,,,,0,,0,,,
32504,,Romania,23,,,,2,58,2,3,,,,,63,1,156,1,25.887573,,3,,,,,0,,6,Diet related to health condition (condition unspecified),,
32505,,Romania,23,,,,2,71,2,2,,,,,85,1,158,1,34.04903,,4,,,,,0,,6,Diet related to health condition (condition unspecified),,
32506,,Romania,23,,,,2,37,2,3,,,,,60,1,167,1,21.513859,,2,,,,,0,,0,,,
32507,,Romania,23,,,,1,55,2,3,,,,,98,1,185,1,28.634039,,3,,,,,0,,6,Diet related to health condition (condition unspecified),,
32508,,Romania,23,,,,1,56,3,4,,,,,94,1,183,1,28.068918,,3,,,,,0,,0,,,
32509,,Romania,23,,,,1,32,2,3,,,,,103,1,175,1,33.632652,,4,,,,,0,,0,,,
32510,,Romania,23,,,,1,38,,,,,,,120,1,190,1,33.240997,,4,,,,,0,,0,,,
32511,,Romania,23,,,,1,58,3,4,,,,,80,1,172,1,27.041645,,3,,,,,0,,0,,,
32512,,Romania,23,,,,1,60,2,3,,,,,90,1,170,1,31.141869,,4,,,,,0,,6,Diet related to health condition (condition unspecified),,
32513,,Romania,23,,,,1,49,3,4,,,,,73,1,178,1,23.04002,,2,,,,,0,,0,,,
32514,,Romania,23,,,,1,41,2,3,,,,,110,1,175,1,35.918365,,4,,,,,0,,6,Diet related to health condition (condition unspecified),,
32515,,Romania,23,,,,2,45,2,3,,,,,85,1,170,1,29.411764,,3,,,,,0,,0,,,
32516,,Romania,23,,,,2,58,2,2,,,,,63,1,167,1,22.589552,,2,,,,,0,,0,,,
32517,,Romania,23,,,,2,30,2,3,,,,,52,1,163,1,19.571682,,2,,,,,0,,0,,,
32518,,Romania,23,,,,1,49,2,3,,,,,81,1,175,1,26.44898,,3,,,,,0,,0,,,
32519,,Romania,23,,,,1,78,2,2,,,,,70,1,190,1,19.390581,,2,,,,,0,,0,,,
32520,,Romania,23,,,,1,70,2,2,,,,,80,1,180,1,24.691359,,2,,,,,0,,6,Diet related to health condition (condition unspecified),,
32521,,Romania,23,,,,1,68,2,2,,,,,65,1,174,1,21.469151,,2,,,,,0,,0,,,
32522,,Romania,23,,,,1,38,2,2,,,,,90,1,185,1,26.296566,,3,,,,,0,,6,Diet related to health condition (condition unspecified),,
32523,,Romania,23,,,,1,68,2,2,,,,,67,1,175,1,21.87755,,2,,,,,0,,6,Diet related to health condition (condition unspecified),,
32524,,Romania,23,,,,2,80,2,2,,,,,60,1,150,1,26.666666,,3,,,,,0,,6,Diet related to health condition (condition unspecified),,
32525,,Romania,23,,,,2,78,2,2,,,,,53,1,155,1,22.060354,,2,,,,,0,,6,Diet related to health condition (condition unspecified),,
32526,,Romania,23,,,,2,74,2,2,,,,,70,1,175,1,22.857143,,2,,,,,0,,0,,,
32527,,Romania,23,,,,2,67,2,2,,,,,65,1,160,1,25.390625,,3,,,,,0,,6,Diet related to health condition (condition unspecified),,
32528,,Romania,23,,,,2,63,2,2,,,,,75,1,159,1,29.666548,,3,,,,,0,,0,,,
32529,,Romania,28,,,,2,65,3,4,,,,,63,1,156,1,25.887573,,3,,,,,0,,0,,,
32530,,Romania,31,,,,1,28,3,4,,,,,80,1,176,1,25.826447,,3,,,,,0,,0,,,
32531,,Romania,31,,,,1,41,3,4,,,,,65,1,178,1,20.515087,,2,,,,,0,,0,,,
32532,,Romania,31,,,,1,39,3,4,,,,,60,1,160,1,23.4375,,2,,,,,0,,0,,,
32533,,Romania,31,,,,1,22,3,4,,,,,76,1,189,1,21.276001,,2,,,,,0,,0,,,
32534,,Romania,31,,,,1,45,3,4,,,,,78,1,170,1,26.98962,,3,,,,,0,,0,,,