id,hh_id,country,sec_area,tert_area,round,smpl_weight,sex,age,edc_level,edc,residence,preg_lact,breastfeeding,hh_head,wgt,wgt_method,hgt,hgt_method,bmi_adults,bmi_children,bmi_cat,misrep,pa,pa_cat,smok,special_diet,special_diet_other,clin_diet,clin_diet_other,note,p4txt1_c,P5_1,P6_1,p7_1,P8_1,p4txt2_c,P5_2,P6_2,p7_2,P8_2,p4txt3_c,P5_3,P6_3,p7_3,P8_3,p4txt4_c,P5_4,P6_4,p7_4,P8_4
254,,Israel,4,,1,1.431743174317432,2,15,,,2,,,,,,163.3,1,,,,,,,2,5,Vegetarian and on weight loss diet,,,,2,1,60,2,3,,,,,,,,,,,,,,,
255,,Israel,4,,1,1.431743174317432,2,16,,,2,,,,65,1,151.15,1,,93.99494181653085,3,,,,3,0,,,,,1,1,30,2,1,2,3,60,1,1,6,1,5,1,2,6,3,30,2,1
260,,Israel,4,,1,1.431743174317432,2,15,,,2,,,,59,1,152,1,,89.15118110577113,3,,,,1,1,,,,,1,1,15,2,2,2,4,60,1,3,,,,,,,,,,
263,,Israel,4,,1,1.431743174317432,2,16,,,2,,,,44,1,152.8,1,,24.53056405234316,2,,,,1,0,,,,,1,1,20,2,1,2,2,1.5,2,1,,,,,,,,,,
288,,Israel,1,,1,.8174070247933885,2,15,,,2,,,,46,1,150.15,1,,55.76204047371689,2,,,,1,0,,,,,1,2,5,3,2,,,,,,,,,,,,,,,
290,,Israel,1,,1,.8174070247933885,2,15,,,2,,,,54.5,1,167,1,,43.11125461931443,2,,,,1,0,,,,,2,2,10,2,2,2,2,10,3,1,4,2,15,2,1,,,,,
294,,Israel,1,,1,.8174070247933885,2,14,,,2,,,,56,1,162.4,1,,66.08434294423107,2,,,,1,5,Vegetarian and on other diet,,,,6,1,5,3,1,2,3,50,2,1,2,2,20,3,2,4,2,20,,
317,,Israel,1,,1,.8174070247933885,1,12,,,2,,,,35,1,155.2,1,,1.339841137722117,1,,,,1,0,,,,,2,2,120,2,1,2,1,7,3,2,4,2,20,3,1,4,1,20,3,2
325,,Israel,1,,1,.8174070247933885,1,12,,,2,,,,51,1,165.25,1,,54.54251327583464,2,,,,1,0,,,,,4,1,120,2,3,2,1,60,2,3,2,4,15,1,2,2,2,180,3,3
333,,Israel,1,,1,1.431743174317432,1,15,,,2,,,,60.5,1,172.55,1,,47.79208640997723,2,,,,1,0,,,,,,,,,,,,,,,,,,,,,,,,
345,,Israel,1,,1,1.431743174317432,1,16,,,2,,,,55,1,177.3,1,,7.12599911949245,2,,,,5,0,,,,,7,1,30,1,2,2,2,180,1,2,,,,,,,,,,
356,,Israel,1,,1,1.431743174317432,1,16,,,2,,,,62,1,163,1,,78.18774908621734,2,,,,3,0,,,,,4,,30,2,2,,,,,,,,,,,,,,,
360,,Israel,1,,1,1.431743174317432,1,16,,,2,,,,48,1,166.75,1,,4.196191123087056,1,,,,3,0,,,,,4,1,15,3,3,4,1,15,3,3,2,2,30,2,1,,,,,
362,,Israel,4,,1,.8174070247933885,1,15,,,1,,,,63,1,179.5,1,,40.44252070438417,2,,,,1,3,,,,,2,4,45,2,1,4,2,30,2,1,1,2,2,2,1,2,4,30,2,1
366,,Israel,4,,1,.8174070247933885,1,14,,,1,,,,54,1,164.5,1,,53.57914029603234,2,,,,1,0,,,,,4,2,60,2,2,2,3,45,1,1,,,,,,,,,,
370,,Israel,4,,1,.8174070247933885,1,14,,,1,,,,62,1,179.5,1,,45.47394666568568,2,,,,1,0,,,,,2,2,30,2,2,4,2,120,2,3,6,2,30,1,1,,,,,
386,,Israel,4,,1,.8174070247933885,1,13,,,2,,,,55,1,160,1,,78.54414679612167,2,,,,1,3,,,,,4,1,120,2,3,4,3,60,2,3,1,2,45,2,1,2,,30,2,3
405,,Israel,4,,1,.8174070247933885,1,15,,,2,,,,72,1,177.55,1,,79.09505319327475,2,,,,5,3,,,,,,,,,,,,,,,,,,,,,,,,
448,,Israel,5,,1,.8174070247933885,1,14,,,2,,,,77.5,1,181,1,,88.70490935562062,3,,,,3,3,,,,,2,3,10,1,2,1,2,50,2,2,2,4,90,3,1,,,,,
469,,Israel,4,,1,1.431743174317432,2,17,,,2,,,,52.5,1,158.4,1,,47.89640142945019,2,,,,5,3,,,,,1,2,90,2,1,,,,,,,,,,,,,,,
479,,Israel,4,,1,1.431743174317432,1,17,,,2,,,,79,1,191.25,1,,54.51385769043926,2,,,,1,0,,,,,4,1,90,2,3,2,1,30,2,3,6,2,90,1,1,7,2,50,3,3
490,,Israel,6,,1,1.431743174317432,1,16,,,2,,,,72.5,1,180.85,1,,67.68679676863755,2,,,,1,3,,,,,2,2,40,2,1,4,2,90,2,2,,,,,,,,,,
493,,Israel,6,,1,1.431743174317432,2,15,,,2,,,,57,1,167.3,1,,50.20053885770691,2,,,,1,5,Vegetarian and on maintenance diet,,,,6,1,2,2,2,1,1,30,3,2,5,2,90,2,2,6,2,1,2,2
494,,Israel,6,,1,1.431743174317432,2,16,,,2,,,,63.5,1,166.5,1,,74.21684853494334,2,,,,1,0,,,,,7,2,75,2,1,7,2,45,2,3,2,3,60,1,3,,,,,
542,,Israel,6,,1,.8174070247933885,1,13,,,2,,,,48,1,164.1,1,,29.47317894484189,2,,,,1,0,,,,,4,1,120,1,2,4,3,100,2,1,,,,,,,,,,
552,,Israel,6,,1,.8174070247933885,1,13,,,2,,,,61.5,1,176.05,1,,64.89475110020035,2,,,,5,0,,,,,7,3,90,2,3,4,1,120,1,2,4,2,60,2,2,,,,,
561,,Israel,6,,1,1.431743174317432,1,16,,,2,,,,62.5,1,171.65,1,,57.81028891594369,2,,,,3,0,,,,,6,3,10,2,1,6,3,10,2,1,6,2,5,,1,,,,,
563,,Israel,6,,1,1.431743174317432,2,16,,,2,,,,,,,,,,,,,,3,3,,,,,7,3,40,2,3,6,2,60,2,1,,,,,,,,,,
610,,Israel,4,,1,1.431743174317432,2,16,,,2,,,,44,1,153.65,1,,22.20748451474805,2,,,,5,0,,,,,7,4,,2,1,,,,,,,,,,,,,,,
614,,Israel,4,,1,1.431743174317432,1,16,,,2,,,,,,,,,,,,,,2,0,,,,,2,2,,,,,,,,,,,,,,,,,,
626,,Israel,4,,1,1.431743174317432,1,16,,,2,,,,54,1,168,1,,27.80098221228101,2,,,,1,5,,,,,2,2,15,1,2,2,1,60,2,2,,,,,,,,,,
629,,Israel,4,,1,1.431743174317432,1,15,,,2,,,,,,,,,,,,,,3,0,,,,,4,1,70,1,3,7,3,60,2,,2,1,40,2,1,,,,,
642,,Israel,5,,1,.8174070247933885,1,13,,,2,,,,45,1,158.75,1,,35.44938149062371,2,,,,1,0,,,,,2,1,,,,,,,,,,,,,,,,,,
656,,Israel,5,,1,.8174070247933885,2,13,,,2,,,,47,1,159.4,1,,42.45972358211683,2,,,,1,0,,,,,,,,,,,,,,,,,,,,,,,,
671,,Israel,5,,1,.8174070247933885,2,13,,,2,,,,45,1,162,1,,20.40877906685204,2,,,,1,0,,,,,2,3,60,2,2,,,,,,,,,,,,,,,
684,,Israel,4,,1,1.431743174317432,1,15,,,2,,,,72,1,170.6,1,,87.8639372533391,3,,,,5,0,,,,,4,2,80,3,2,1,1,140,3,3,6,1,30,1,1,2,2,,2,2
688,,Israel,4,,1,1.431743174317432,2,16,,,2,,,,52.5,1,158,1,,55.97588702671672,2,,,,1,5,Vegetarian and on weight loss diet,,,,7,2,15,2,1,5,2,20,3,1,,,,,,,,,,
717,,Israel,5,,1,.8174070247933885,2,12,,,2,,,,,,159.5,1,,,,,,,1,0,,,,,7,2,7,2,1,,,,,,,,,,,,,,,
718,,Israel,5,,1,.8174070247933885,2,12,,,2,,,,60,1,152,1,,95.41398419864929,4,,,,1,0,,,,,,,,,,,,,,,,,,,,,,,,
723,,Israel,5,,1,.8174070247933885,1,13,,,2,,,,65,1,171,1,,85.01708096672546,3,,,,1,0,,,,,2,2,60,2,1,4,1,15,2,3,2,2,30,3,3,4,2,15,3,3
728,,Israel,5,,1,.8174070247933885,2,14,,,2,,,,57.25,1,152.75,1,,88.56393231653345,3,,,,,5,Vegetarian and on weight loss diet,,,,7,1,45,2,3,,,,,,,,,,,,,,,
732,,Israel,5,,1,.8174070247933885,2,14,,,2,,,,52,1,167.85,1,,30.63966063885783,2,,,,1,0,,,,,1,2,20,3,3,7,2,10,3,2,,,,,,,,,,
736,,Israel,5,,1,.8174070247933885,2,15,,,2,,,,52,1,157.2,1,,62.08895541887796,2,,,,1,0,,,,,,,,,,,,,,,,,,,,,,,,
741,,Israel,5,,1,.8174070247933885,2,15,,,2,,,,54,1,148.4,1,,85.76580795414427,3,,,,1,3,,,,,5,2,50,2,3,5,2,40,2,3,2,2,60,1,2,,,,,
746,,Israel,5,,1,.8174070247933885,2,14,,,2,,,,50,1,159,1,,50.77827381901437,2,,,,1,3,,,,,2,2,60,2,1,7,2,40,,,,,,,,,,,,
767,,Israel,3,,1,.8174070247933885,1,14,,,2,,,,55,1,159.5,1,,75.47372763339776,2,,,,5,0,,,,,7,2,50,3,3,4,2,90,2,3,1,1,15,3,2,,,,,
778,,Israel,3,,1,.8174070247933885,1,14,,,2,,,,37.25,1,148.5,1,,9.273785179242923,2,,,,1,0,,,,,4,2,30,2,2,4,1,45,2,2,2,1,30,2,2,6,2,30,1,2
784,,Israel,3,,1,.8174070247933885,1,14,,,2,,,,45.25,1,162.5,1,,12.50838993264201,2,,,,3,0,,,,,2,2,15,2,1,2,2,45,2,1,4,1,60,3,3,2,1,10,3,3
793,,Israel,3,,1,.8174070247933885,2,15,,,2,,,,51,1,154.5,1,,64.99850813953452,2,,,,1,0,,,,,2,2,60,2,1,1,2,90,2,1,4,2,60,2,2,,,,,
797,,Israel,3,,1,.8174070247933885,2,14,,,2,,,,52.5,1,161.75,1,,53.3027323033003,2,,,,1,0,,,,,2,2,60,2,2,,,,,,,,,,,,,,,
812,,Israel,3,,1,.8174070247933885,2,15,,,2,,,,47.75,1,157,1,,40.69984340902077,2,,,,1,0,,,,,7,2,45,2,3,,,,,,,,,,,,,,,
820,,Israel,3,,1,.8174070247933885,2,14,,,2,,,,53,1,160,1,,63.71833597304134,2,,,,1,0,,,,,6,1,1,2,1,2,2,120,2,1,,,,,,,,,,
829,,Israel,2,,1,.8174070247933885,2,12,,,2,,,,40,1,144,1,,61.9279270746891,2,,,,1,0,,,,,5,3,90,2,2,7,2,20,1,1,,,,,,,,,,
833,,Israel,2,,1,.8174070247933885,1,13,,,2,,,,50,1,150,1,,84.98082738050886,2,,,,1,0,,,,,4,,120,3,3,,,,,,,,,,,,,,,
837,,Israel,2,,1,.8174070247933885,2,13,,,2,,,,46,1,158,1,,41.40091165032199,2,,,,1,,,,,,2,4,,2,1,2,1,,2,2,4,2,,2,1,4,1,,2,1
870,,Israel,3,,1,.8174070247933885,2,13,,,2,,,,67,1,157.5,1,,94.92925612719007,3,,,,5,1,,,,,2,2,3.5,2,3,6,1,15,1,1,,,,,,,,,,
881,,Israel,3,,1,.8174070247933885,2,14,,,2,,,,52.5,1,160.5,1,,61.28766987987743,2,,,,3,3,,,,,2,2,5,2,3,1,1,17,2,2,7,2,60,1,3,2,3,160,3,3
889,,Israel,2,,1,1.431743174317432,1,16,,,2,,,,45,1,158.5,1,,9.974594939057166,2,,,,5,0,,,,,4,4,90,2,3,,,,,,,,,,,,,,,
902,,Israel,2,,1,1.431743174317432,2,15,,,2,,,,50,1,155,1,,55.32012896457423,2,,,,1,3,,,,,1,3,50,2,3,2,3,40,2,3,7,3,45,3,3,,,,,
908,,Israel,2,,1,1.431743174317432,1,15,,,2,,,,67,1,188,1,,26.7776666393555,2,,,,1,0,,,,,2,2,10,2,2,4,2,90,3,2,6,2,15,2,1,,,,,
909,,Israel,2,,1,1.431743174317432,2,16,,,2,,,,72,1,171.5,1,,84.08383814153343,2,,,,1,3,,,,,6,1,5,2,1,7,1,5,3,1,5,2,120,2,1,5,1,30,2,1
918,,Israel,3,,1,1.431743174317432,2,15,,,2,,,,58,1,167.5,1,,56.80281124526825,2,,,,1,0,,,,,2,3,360,3,3,6,1,3,2,1,1,1,30,3,3,,,,,
932,,Israel,3,,1,1.431743174317432,2,15,,,2,,,,63,1,170.75,1,,66.04408363012088,2,,,,1,0,,,,,7,2,45,3,3,,,,,,,,,,,,,,,
938,,Israel,3,,1,1.431743174317432,2,16,,,2,,,,61.5,1,159,1,,83.1462140106668,2,,,,1,,,,,,1,3,35,3,1,,,,,,,,,,,,,,,
949,,Israel,2,,1,.8174070247933885,2,14,,,2,,,,50.5,1,158.5,1,,56.79824325099187,2,,,,1,3,,,,,4,1,30,3,1,1,1,35,2,1,2,4,15,3,1,,,,,
950,,Israel,2,,1,.8174070247933885,2,13,,,2,,,,47,1,154.25,1,,56.90948843387918,2,,,,1,1,,,,,7,3,50,3,3,7,1,30,3,1,,,,,,,,,,
952,,Israel,2,,1,.8174070247933885,2,13,,,2,,,,60,1,160,1,,86.61817301634079,3,,,,1,0,,,,,1,2,50,2,1,6,3,20,1,1,,,,,,,,,,
978,,Israel,1,,1,1.431743174317432,1,15,,,2,,,,66.5,1,168,1,,82.22810727023948,2,,,,1,0,,,,,6,1,10,2,1,,,,,,,,,,,,,,,
990,,Israel,1,,1,1.431743174317432,1,16,,,2,,,,77,1,184,1,,74.92868927729144,2,,,,1,0,,,,,4,1,60,1,3,,,,,,,,,,,,,,,
1003,,Israel,3,,1,.8174070247933885,1,15,,,2,,,,66,1,173.5,1,,72.00104825373268,2,,,,3,,,,,,4,2,240,1,2,2,3,120,1,1,,,,,,,,,,
1010,,Israel,3,,1,.8174070247933885,2,14,,,2,,,,45,1,161,1,,15.73831322466829,2,,,,5,0,,,,,1,2,40,2,1,6,2,20,2,1,,,,,,,,,,
1019,,Israel,3,,1,.8174070247933885,2,15,,,2,,,,44.25,1,163,1,,7.324378380065369,2,,,,5,1,,,,,1,,90,2,2,,,,,,,,,,,,,,,
1025,,Israel,3,,1,.8174070247933885,1,16,,,2,,,,59,1,160.5,1,,74.7339708516853,2,,,,5,0,,,,,6,1,20,2,1,6,1,40,2,1,2,1,15,2,1,2,3,75,2,1
1040,,Israel,3,,1,.8174070247933885,1,14,,,1,,,,48,1,160.5,1,,36.5492182555659,2,,,,1,0,,,,,2,2,30,1,2,6,1,30,,2,2,1,60,2,2,,,,,
1041,,Israel,3,,1,.8174070247933885,1,13,,,1,,,,54.5,1,165,1,,64.05829331982537,2,,,,1,0,,,,,2,2,30,2,1,2,1,120,1,2,2,3,240,1,1,6,1,30,1,1
1050,,Israel,2,,1,.8174070247933885,2,13,,,2,,,,49,1,157.75,1,,56.7728573173093,2,,,,1,3,,,,,2,2,10,1,3,4,2,60,2,1,1,3,60,3,2,,,,,
1059,,Israel,2,,1,.8174070247933885,2,13,,,2,,,,60.5,1,168.8,1,,74.35446610084648,2,,,,1,3,,,,,2,2,240,3,1,,,,,,,,,,,,,,,
1061,,Israel,2,,1,.8174070247933885,2,13,,,2,,,,59,1,153,1,,91.89371102188272,3,,,,5,0,,,,,2,2,15,2,3,2,4,6,2,1,1,2,20,2,1,,,,,
1065,,Israel,2,,1,.8174070247933885,2,14,,,2,,,,52,1,154,1,,75.74633632582838,2,,,,1,0,,,,,2,1,60,2,2,6,1,10,1,1,2,3,180,2,1,1,3,60,2,1
1073,,Israel,2,,1,.8174070247933885,1,14,,,2,,,,,,163.75,1,,,,,,,1,0,,,,,2,2,45,2,1,4,1,60,3,3,6,2,15,2,1,6,1,10,3,1
1074,,Israel,2,,1,.8174070247933885,1,14,,,2,,,,,,152.5,1,,,,,,,1,0,,,,,2,2,7.5,1,3,,,,,,,,,,,,,,,
1085,,Israel,2,,1,.8174070247933885,2,14,,,2,,,,76,1,151.75,1,,98.41170057189581,4,,,,1,5,Vegetarian and on maintenance diet,,,,1,1,60,1,1,2,4,30,2,1,4,4,30,3,1,,,,,
1086,,Israel,2,,1,.8174070247933885,2,13,,,2,,,,,,157,1,,,,,,,1,0,,,,,2,3,4,2,1,6,2,5,2,1,,,,,,,,,,
1103,,Israel,2,,1,.8174070247933885,2,12,,,1,,,,37,1,144,1,,38.60461469938119,2,,,,1,1,,,,,2,3,10,2,2,4,2,30,2,2,,,,,,,,,,
1116,,Israel,2,,1,.8174070247933885,1,13,,,1,,,,45,1,144.5,1,,83.0856870940393,2,,,,1,0,,,,,4,1,180,2,3,2,2,45,1,3,,,,,,,,,,
1118,,Israel,2,,1,.8174070247933885,2,12,,,1,,,,39,1,152,1,,24.49183770196636,2,,,,1,0,,,,,5,2,60,2,2,5,2,90,1,2,,,,,,,,,,
1123,,Israel,2,,1,.8174070247933885,2,12,,,1,,,,53,1,155,1,,84.30256662963994,2,,,,1,0,,,,,2,4,10,3,1,2,2,60,2,3,,,,,,,,,,
1130,,Israel,4,,1,.8174070247933885,1,13,,,2,,,,39,1,156,1,,10.20558151448538,2,,,,1,0,,,,,2,2,10,2,1,6,2,30,2,1,4,3,30,1,2,,,,,
1137,,Israel,4,,1,.8174070247933885,1,13,,,2,,,,40.5,1,159.9,1,,6.117809426530931,2,,,,1,0,,,,,4,1,300,2,3,2,,60,2,2,1,,60,3,2,2,,180,3,3
1144,,Israel,6,,1,1.431743174317432,2,16,,,2,,,,57,1,155.05,1,,79.0743056697255,2,,,,1,3,,,,,1,1,25,2,1,4,4,60,2,2,,,,,,,,,,
1159,,Israel,6,,1,.8174070247933885,2,15,,,2,,,,62.5,1,155.45,1,,90.23257450801987,3,,,,1,0,,,,,2,2,20,2,2,2,2,40,2,2,6,2,20,2,2,6,2,30,2,2
1164,,Israel,6,,1,.8174070247933885,1,15,,,2,,,,58,1,168,1,,55.26983862374545,2,,,,1,0,,,,,2,1,30,2,2,,,,,,,,,,,,,,,
1176,,Israel,6,,1,.8174070247933885,1,15,,,2,,,,66,1,182.5,1,,41.00274630109156,2,,,,1,0,,,,,4,1,120,1,2,4,2,120,2,2,2,3,,3,2,2,3,,1,3
1187,,Israel,6,,1,.8174070247933885,1,12,,,2,,,,59.5,1,162,1,,89.18035851631917,3,,,,1,0,,,,,1,3,60,3,1,,,,,,,,,,,,,,,
1197,,Israel,6,,1,.8174070247933885,1,13,,,2,,,,53,1,161,1,,73.5048885219356,2,,,,1,0,,,,,4,1,150,2,3,,,,,,,,,,,,,,,
1207,,Israel,6,,1,.8174070247933885,2,12,,,2,,,,36.5,1,144.35,1,,37.38699267302662,2,,,,1,0,,,,,3,1,45,2,2,2,4,15,1,1,2,,20,1,1,7,1,35,1,2
1211,,Israel,6,,1,.8174070247933885,2,15,,,2,,,,47,1,162.5,1,,17.99325672864674,2,,,,5,0,,,,,7,2,10,2,1,6,2,10,2,2,2,2,10,2,2,1,4,90,2,1
1215,,Israel,6,,1,.8174070247933885,2,15,,,2,,,,39.5,1,156.9,1,,3.407520508118268,1,,,,1,0,,,,,1,3,90,3,1,,,,,,,,,,,,,,,
1225,,Israel,6,,1,.8174070247933885,2,14,,,2,,,,55.5,1,162.4,1,,65.16821305987013,2,,,,5,1,,,,,6,2,5,2,1,1,3,90,2,1,,,,,,,,,,
1233,,Israel,6,,1,.8174070247933885,1,14,,,2,,,,45.5,1,160.2,1,,20.44679811148268,2,,,,1,0,,,,,2,1,120,2,1,4,1,90,1,2,4,4,30,3,1,6,2,60,,1
1247,,Israel,6,,1,1.431743174317432,1,16,,,2,,,,51,1,167.15,1,,12.49153648629297,2,,,,5,1,,,,,,,,,,,,,,,,,,,,,,,,
1249,,Israel,4,,1,.8174070247933885,1,12,,,1,,,,42,1,152.35,1,,46.06686393158335,2,,,,1,0,,,,,2,1,20,3,3,4,2,120,3,3,4,2,60,3,1,,,,,
1258,,Israel,4,,1,.8174070247933885,1,12,,,1,,,,45,1,156.4,1,,53.7170252593023,2,,,,1,0,,,,,4,2,300,2,2,2,1,60,1,3,4,2,60,2,2,6,1,30,1,1
1263,,Israel,4,,1,.8174070247933885,1,14,,,1,,,,42,1,149.4,1,,43.23732956492287,2,,,,1,1,,,,,6,2,,,,,,,,,,,,,,,,,,
1271,,Israel,4,,1,.8174070247933885,2,14,,,2,,,,54,1,160.25,1,,66.54977964111947,2,,,,,1,,,,,2,3,65,2,1,,,,,,,,,,,,,,,
1275,,Israel,4,,1,.8174070247933885,1,13,,,2,,,,49.5,1,166,1,,36.37262866496847,2,,,,1,4,,,,,2,1,40,1,2,4,2,105,2,2,2,1,70,2,3,2,2,80,2,2
1286,,Israel,4,,1,.8174070247933885,1,14,,,2,,,,50.5,1,165.6,1,,29.39758061994002,2,,,,1,0,,,,,,,,,,,,,,,,,,,,,,,,
1291,,Israel,4,,1,.8174070247933885,1,14,,,2,,,,44,1,159.2,1,,16.68676110325465,2,,,,1,0,,,,,4,2,150,2,3,4,4,120,1,1,3,2,60,2,2,,,,,
1310,,Israel,4,,1,1.431743174317432,2,16,,,1,,,,49,1,156.5,1,,42.05051428883227,2,,,,1,0,,,,,1,1,30,2,1,,,,,,,,,,,,,,,
1316,,Israel,4,,1,1.431743174317432,2,16,,,1,,,,40,1,154.5,1,,4.473522486092575,1,,,,1,0,,,,,2,1,20,3,2,4,3,30,3,3,7,2,45,3,3,2,2,60,2,3
1321,,Israel,6,,1,.8174070247933885,1,15,,,2,,,,65.5,1,173.55,1,,69.63251669527952,2,,,,2,0,,,,,4,2,15,2,3,2,1,180,3,2,2,3,300,3,2,1,2,120,3,2
1331,,Israel,6,,1,.8174070247933885,1,15,,,2,,,,81,1,173,1,,94.8265601536981,3,,,,3,3,,,,,2,2,60,2,1,,,,,,,,,,,,,,,
1346,,Israel,5,,1,.8174070247933885,2,15,,,2,,,,56,1,159.3,1,,71.12180186360068,2,,,,1,5,Vegetarian and on weight loss diet,,,,2,4,120,2,3,5,2,60,2,2,,,,,,,,,,
1351,,Israel,5,,1,.8174070247933885,2,14,,,2,,,,44,1,155.35,1,,27.38410447036499,2,,,,1,0,,,,,,,,,,,,,,,,,,,,,,,,
1352,,Israel,5,,1,.8174070247933885,2,14,,,2,,,,36,1,135.7,1,,45.75912100130186,2,,,,1,0,,,,,1,1,10,3,2,1,3,30,3,3,,,,,,,,,,
1361,,Israel,5,,1,.8174070247933885,2,14,,,2,,,,52,1,155,1,,71.32294674693281,2,,,,1,0,,,,,2,2,15,2,1,1,3,45,2,1,,,,,,,,,,
1369,,Israel,5,,1,.8174070247933885,2,13,,,2,,,,77,1,170.25,1,,94.64291945931083,3,,,,1,3,,,,,2,2,50,2,1,,,,,,,,,,,,,,,
1373,,Israel,5,,1,.8174070247933885,2,14,,,2,,,,46,1,158.75,1,,33.73621531882226,2,,,,5,0,,,,,1,3,25,2,1,4,4,,,,2,2,,,,,,,,
1393,,Israel,5,,1,.8174070247933885,1,14,,,2,,,,62,1,166.25,1,,82.36733263524306,2,,,,5,5,Vegetarian and on weight loss diet,,,,1,1,60,2,1,6,2,50,1,1,,,,,,,,,,
1407,,Israel,4,,1,.8174070247933885,1,15,,,2,,,,44,1,163,1,,3.23166840254834,1,,,,3,0,,,,,4,2,45,3,3,,,,,,,,,,,,,,,
1408,,Israel,4,,1,.8174070247933885,1,15,,,2,,,,50,1,170.8,1,,9.76964062587806,2,,,,2,0,,,,,4,1,90,3,3,2,3,120,3,1,2,2,12,2,3,,,,,
1410,,Israel,5,,1,.8174070247933885,2,13,,,2,,,,37,1,150.85,1,,13.14131607538254,2,,,,1,0,,,,,2,2,60,3,1,3,2,60,3,2,5,2,60,3,3,,,,,
1414,,Israel,5,,1,.8174070247933885,1,13,,,2,,,,82,1,160.5,1,,98.86809267740414,4,,,,1,0,,,,,2,1,480,2,2,4,2,60,3,2,,,,,,,,,,
1437,,Israel,5,,1,.8174070247933885,2,13,,,2,,,,80,1,165.3,1,,97.29300141093115,4,,,,,0,,,,,,,,,,,,,,,,,,,,,,,,
1441,,Israel,4,,1,.8174070247933885,2,13,,,2,,,,65,1,161.9,1,,90.8939832992685,3,,,,1,5,Weight loss and other diet,,,,2,1,20,2,1,1,3,30,2,1,,,,,,,,,,
1445,,Israel,4,,1,.8174070247933885,2,15,,,2,,,,45,1,139.95,1,,77.62253850911785,2,,,,1,0,,,,,2,2,30,3,3,,,,,,,,,,,,,,,
1450,,Israel,4,,1,.8174070247933885,2,13,,,2,,,,60,1,158.4,1,,87.94644323780523,3,,,,1,0,,,,,2,4,60,2,2,2,3,120,3,2,1,3,6,3,2,,,,,
1455,,Israel,4,,1,.8174070247933885,2,13,,,2,,,,82,1,158.5,1,,98.53980555592557,4,,,,1,5,Vegetarian and on weight loss diet,,,,2,1,45,2,3,4,2,30,2,2,1,1,30,2,1,7,2,30,2,2
1477,,Israel,4,,1,1.431743174317432,2,15,,,1,,,,59,1,160,1,,77.77358243587676,2,,,,1,0,,,,,4,2,120,1,2,,,,,,,,,,,,,,,
1491,,Israel,4,,1,1.431743174317432,2,16,,,1,,,,48,1,162.5,1,,15.90955182245487,2,,,,1,5,Vegetarian and on weight loss diet,,,,2,1,90,3,3,4,3,45,2,3,2,2,50,2,2,4,3,30,3,3
1499,,Israel,4,,1,.8174070247933885,2,14,,,2,,,,50,1,169.5,1,,19.02338234995557,2,,,,1,0,,,,,2,2,10,3,2,4,3,30,3,2,4,3,40,3,2,1,1,5,3,2
1548,,Israel,5,,1,1.431743174317432,1,16,,,2,,,,80.5,1,179,1,,87.67150328399909,3,,,,3,0,,,,,7,2,40,2,2,,,,,,,,,,,,,,,
1553,,Israel,5,,1,1.431743174317432,2,16,,,2,,,,49,1,157,1,,39.19132276506893,2,,,,3,1,,,,,,,,,,,,,,,,,,,,,,,,
1558,,Israel,5,,1,1.431743174317432,2,16,,,2,,,,49,1,148,1,,68.41850908900815,2,,,,3,0,,,,,,,,,,,,,,,,,,,,,,,,
1564,,Israel,4,,1,1.431743174317432,2,17,,,2,,,,57,1,163.5,1,,53.37045991314427,2,,,,1,3,,,,,,,,,,,,,,,,,,,,,,,,
1567,,Israel,4,,1,1.431743174317432,2,16,,,2,,,,59.5,1,173,1,,38.16775820268749,2,,,,1,1,,,,,,,,,,,,,,,,,,,,,,,,
1587,,Israel,5,,1,.8174070247933885,2,15,,,1,,,,50,1,165,1,,24.40901060946771,2,,,,2,1,,,,,,,,,,,,,,,,,,,,,,,,
1588,,Israel,5,,1,.8174070247933885,2,13,,,1,,,,64,1,167,1,,83.52525345495056,2,,,,1,,,,,,2,1,180,,,,,,,,,,,,,,,,,
1606,,Israel,5,,1,1.431743174317432,2,17,,,1,,,,69.5,1,157.65,1,,91.9886759770724,3,,,,3,0,,,,,2,3,40,2,2,2,3,60,2,2,,,,,,,,,,
1609,,Israel,5,,1,1.431743174317432,2,16,,,1,,,,58,1,164.65,1,,57.97393109832678,2,,,,5,0,,,,,2,3,100,2,2,2,3,100,3,,2,4,30,2,,,,,,
1651,,Israel,2,,1,1.431743174317432,1,16,,,2,,,,75,1,181,1,,72.50283513352737,2,,,,5,,,,,,4,1,120,2,3,2,1,60,1,2,,,,,,,,,,
1657,,Israel,2,,1,1.431743174317432,2,16,,,2,,,,72.25,1,155,1,,95.8821105417628,4,,,,1,0,,,,,2,2,10,2,2,1,1,30,3,2,4,3,60,3,2,5,2,90,3,3
1673,,Israel,2,,1,1.431743174317432,2,15,,,2,,,,62.75,1,165.25,1,,76.35725133476542,2,,,,1,0,,,,,1,4,45,3,2,6,3,120,2,2,,,,,,,,,,
1684,,Israel,2,,1,1.431743174317432,2,14,,,2,,,,55,1,164,1,,59.18173459449923,2,,,,1,0,,,,,1,1,5,3,2,1,,20,2,2,,,,,,,,,,
1704,,Israel,6,,1,1.431743174317432,2,17,,,2,,,,48,1,161.75,1,,12.454947216601,2,,,,1,0,,,,,2,3,60,2,1,2,2,15,1,1,1,1,30,2,1,,,,,
1720,,Israel,6,,1,1.431743174317432,2,17,,,2,,,,53.5,1,160.5,1,,47.0997352871949,2,,,,1,0,,,,,,,,,,,,,,,,,,,,,,,,
1721,,Israel,6,,1,1.431743174317432,2,17,,,2,,,,94,1,174.25,1,,95.93040037743712,4,,,,1,3,,,,,7,,45,2,3,1,3,,2,2,,,,,,,,,,
1727,,Israel,4,,1,1.431743174317432,2,17,,,2,,,,66,1,154,1,,91.53902580183933,3,,,,3,0,,,,,,,,,,,,,,,,,,,,,,,,
1735,,Israel,4,,1,1.431743174317432,2,17,,,2,,,,62.5,1,160.5,1,,79.49159161797574,2,,,,1,0,,,,,2,3,25,1,1,6,1,6,2,2,7,2,90,3,2,,,,,
1742,,Israel,4,,1,1.431743174317432,2,17,,,2,,,,56.5,1,165.5,1,,44.77544180530609,2,,,,1,0,,,,,1,1,45,2,1,6,1,30,2,3,2,1,30,2,,,,,,
1760,,Israel,6,,1,1.431743174317432,2,16,,,2,,,,55,1,165,1,,45.83553149875564,2,,,,1,3,,,,,1,1,75,3,3,2,2,60,3,1,5,1,120,3,3,,,,,
1769,,Israel,4,,1,1.431743174317432,2,17,,,2,,,,45,1,153.5,1,,24.23081854647483,2,,,,1,0,,,,,2,2,60,2,3,4,2,60,3,3,,,,,,,,,,
1783,,Israel,4,,1,1.431743174317432,2,15,,,2,,,,54,1,174,1,,17.41922058373279,2,,,,1,0,,,,,,,,,,,,,,,,,,,,,,,,
1807,,Israel,5,,1,1.431743174317432,2,17,,,2,,,,48.75,1,157.5,1,,30.2226314724138,2,,,,2,0,,,,,2,2,40,2,1,,,,,,,,,,,,,,,
1808,,Israel,5,,1,1.431743174317432,2,15,,,2,,,,48.5,1,154.25,1,,52.11438215981573,2,,,,1,0,,,,,6,2,10,2,1,2,2,30,1,2,1,4,20,2,1,,,,,
1810,,Israel,5,,1,1.431743174317432,1,17,,,2,,,,75,1,179.4,1,,71.38914064637551,2,,,,1,3,,,,,7,1,85,2,2,2,2,15,1,1,,,,,,,,,,
1825,,Israel,5,,1,1.431743174317432,2,16,,,2,,,,80.75,1,167.5,1,,94.51517166027598,3,,,,1,0,,,,,,,,,,,,,,,,,,,,,,,,
1828,,Israel,5,,1,1.431743174317432,2,16,,,2,,,,47,1,153.75,1,,41.40430576482732,2,,,,1,3,,,,,1,1,25,2,1,7,2,45,3,3,,,,,,,,,,
1848,,Israel,4,,1,1.431743174317432,1,15,,,2,,,,59,1,167.65,1,,61.06740840917245,2,,,,1,0,,,,,4,1,100,3,3,4,2,3,2,2,2,1,10,2,2,,,,,
1865,,Israel,4,,1,1.431743174317432,1,15,,,2,,,,52,1,165.1,1,,37.37823237737364,2,,,,5,0,,,,,2,1,20,2,2,2,2,20,3,2,4,2,200,2,3,4,3,20,3,2
1875,,Israel,4,,1,1.431743174317432,1,15,,,2,,,,77,1,161.5,1,,97.4636990601992,4,,,,1,0,,,,,6,3,10,2,2,6,3,10,2,2,,,,,,,,,,
1902,,Israel,5,,1,1.431743174317432,1,15,,,2,,,,60,1,184.5,1,,12.88976692397026,2,,,,1,0,,,,,4,1,90,1,2,4,2,50,2,,2,2,15,2,,,,,,
1903,,Israel,5,,1,1.431743174317432,2,15,,,2,,,,65,1,154.4,1,,92.93197723177849,3,,,,5,3,,,,,2,2,20,2,1,,,,,,,,,,,,,,,
1905,,Israel,5,,1,1.431743174317432,2,15,,,2,,,,47,1,150,1,,58.30242277084934,2,,,,2,,,,,,2,1,30,2,2,,,,,,,,,,,,,,,
1913,,Israel,5,,1,1.431743174317432,2,16,,,2,,,,42.5,1,161.95,1,,1.125514553612543,1,,,,3,4,,,,,5,1,50,2,3,,,,,,,,,,,,,,,
1923,,Israel,3,,1,1.431743174317432,2,17,,,2,,,,58,1,163.5,1,,57.07699217983273,2,,,,1,0,,,,,1,1,50,2,1,,,,,,,,,,,,,,,
1937,,Israel,3,,1,1.431743174317432,2,16,,,2,,,,40.5,1,153.3,1,,6.149511261550179,2,,,,1,3,,,,,2,2,60,2,1,2,2,20,1,1,6,2,20,3,1,6,2,20,3,1
1949,,Israel,3,,1,1.431743174317432,1,17,,,2,,,,66,1,179.5,1,,34.44000445806053,2,,,,1,0,,,,,1,1,30,3,3,2,3,20,2,3,2,2,60,2,1,,,,,
1972,,Israel,2,,1,1.431743174317432,2,17,,,2,,,,48,1,164,1,,7.349491715920639,2,,,,1,0,,,,,7,,45,2,3,1,2,15,3,2,,,,,,,,,,
1974,,Israel,2,,1,1.431743174317432,2,17,,,2,,,,55,1,161.75,1,,50.41251968953739,2,,,,1,0,,,,,1,1,10,2,3,7,2,30,2,1,2,4,10,2,2,,,,,
1978,,Israel,2,,1,1.431743174317432,2,17,,,2,,,,75,1,160.5,1,,93.71358756743102,3,,,,1,0,,,,,1,2,35,2,1,,,,,,,,,,,,,,,
1986,,Israel,2,,1,1.431743174317432,2,16,,,2,,,,47,1,149.5,1,,55.00257889229887,2,,,,1,0,,,,,2,2,15,3,3,2,2,20,2,3,,,,,,,,,,
1997,,Israel,2,,1,1.431743174317432,2,16,,,2,,,,44,1,148.5,1,,41.29739932026048,2,,,,1,0,,,,,2,2,15,2,2,5,2,45,2,2,1,1,20,3,3,,,,,
2001,,Israel,2,,1,1.431743174317432,2,15,,,2,,,,50,1,160.5,1,,36.38061481505746,2,,,,1,0,,,,,1,1,60,2,2,6,2,5,2,1,2,2,90,3,2,,,,,
2007,,Israel,2,,1,1.431743174317432,2,15,,,2,,,,48.5,1,159.5,1,,37.54258634051831,2,,,,5,1,,,,,2,3,45,3,3,,,,,,,,,,,,,,,
2015,,Israel,2,,1,1.431743174317432,2,15,,,2,,,,55,1,161,1,,60.08055733375447,2,,,,3,0,,,,,7,,60,2,3,5,2,5,3,1,,,,,,,,,,
2017,,Israel,2,,1,1.431743174317432,1,15,,,2,,,,61,1,164,1,,80.19629450819359,2,,,,3,0,,,,,7,2,8,3,2,6,2,1.5,2,2,,,,,,,,,,
2061,,Israel,2,,1,.6883116883116883,2,17,,,2,,,,84,1,181,1,,85.9866469043577,3,,,,1,0,,,,,2,3,30,3,2,4,3,60,3,2,4,2,120,3,1,4,2,45,3,2
2064,,Israel,2,,1,.6883116883116883,2,17,,,2,,,,54.5,1,164,1,,38.0396983233811,2,,,,1,3,,,,,1,1,45,3,2,7,3,45,2,2,4,2,30,3,2,,,,,
2065,,Israel,2,,1,.6883116883116883,1,17,,,2,,,,72,1,183.5,1,,47.68241748211147,2,,,,5,0,,,,,4,1,50,1,3,7,3,120,2,2,4,3,45,3,3,4,3,45,3,3
2073,,Israel,3,,1,.6883116883116883,1,16,,,2,,,,92,1,179,1,,95.8461208665145,4,,,,5,0,,,,,2,4,90,2,2,,,,,,,,,,,,,,,
2076,,Israel,3,,1,.6883116883116883,1,16,,,2,,,,63,1,171,1,,58.32524555766938,2,,,,5,0,,,,,2,1,90,2,2,6,1,150,2,2,,,,,,,,,,
2081,,Israel,3,,1,.6883116883116883,2,16,,,2,,,,51,1,154.5,1,,56.77242075054583,2,,,,1,0,,,,,4,2,40,3,2,4,2,40,3,2,2,,30,2,1,,,,,
2110,,Israel,3,,1,.6883116883116883,1,15,,,2,,,,55,1,171,1,,27.85526867585874,2,,,,1,0,,,,,,,,,,,,,,,,,,,,,,,,
2126,,Israel,3,,1,.6883116883116883,2,15,,,2,,,,66,1,154.5,1,,93.5801256121908,3,,,,1,1,,,,,1,1,20,3,2,,,,,,,,,,,,,,,