id,hh_id,country,sec_area,tert_area,round,smpl_weight,sex,age,edc_level,edc,residence,preg_lact,breastfeeding,hh_head,wgt,wgt_method,hgt,hgt_method,bmi_adults,bmi_children,bmi_cat,misrep,pa,pa_cat,smok,special_diet,special_diet_other,clin_diet,clin_diet_other,note,ethn,bmi_chld
30626493,,Bulgaria,,,,1,2,17,,,,,,,65,1,158,1,,,,,,,,3,,0,,,1,26.037495
30626494,,Bulgaria,,,,1,2,20,,,,,,,51,1,162,1,19.433014,,2,,,,,3,,0,,,1,
30626495,,Bulgaria,,,,1,2,20,,,,,,,67,1,164,1,24.910767,,2,,,,,0,,0,,,1,
30626496,,Bulgaria,,,,1,2,32,,,,,,,49,1,164,1,18.218323,,1,,,,,0,,0,,,1,
30626497,,Bulgaria,,,,1,2,39,,,,,,,64,1,172,1,21.633316,,2,,,,,0,,0,,,1,
30626498,,Bulgaria,,,,1,2,41,,,,,,,68,1,152,1,29.432133,,3,,,,,3,,0,,,1,
30626499,,Bulgaria,,,,1,2,58,,,,,,,64,1,152,1,27.70083,,3,,,,,0,,0,,,1,
30626500,,Bulgaria,,,,1,2,62,,,,,,,84,1,162,1,32.007317,,4,,,,,3,,0,,,1,
30626501,,Bulgaria,,,,1,2,16,,,,,,,57,1,158,1,,,,,,,,,,,,,1,22.83288
30626502,,Bulgaria,,,,1,1,16,,,,,,,52,1,165,1,,,,,,,,0,,0,,,1,19.100092
30626503,,Bulgaria,,,,1,1,18,,,,,,,61,1,172,1,,,,,,,,,,,,,1,20.619253
30626504,,Bulgaria,,,,1,1,20,,,,,,,73,1,172,1,24.675501,,2,,,,,0,,0,,,1,
30626505,,Bulgaria,,,,1,1,21,,,,,,,72,1,187,1,20.589664,,2,,,,,0,,0,,,1,
30626506,,Bulgaria,,,,1,1,27,,,,,,,64,1,172,1,21.633316,,2,,,,,0,,0,,,1,
30626507,,Bulgaria,,,,1,1,32,,,,,,,70.5,1,184,1,20.823488,,2,,,,,0,,6,Diet related to health condition (condition unspecified),,1,
30626508,,Bulgaria,,,,1,1,36,,,,,,,76,1,178,1,23.98687,,2,,,,,,,,,,1,
30626509,,Bulgaria,,,,1,1,37,,,,,,,90,1,174,1,29.726517,,3,,,,,0,,6,Diet related to health condition (condition unspecified),,1,
30626510,,Bulgaria,,,,1,1,36,,,,,,,100,1,178,1,31.561672,,4,,,,,0,,0,,,1,
30626511,,Bulgaria,,,,1,1,18,,,,,,,65.5,1,170,1,,,,,,,,,,,,,3,22.66436
30626512,,Bulgaria,,,,1,1,20,,,,,,,59.5,1,171,1,20.348141,,2,,,,,,,,,,3,
30626513,,Bulgaria,,,,1,1,20,,,,,,,64,1,180,1,19.753086,,2,,,,,0,,0,,,1,
30626514,,Bulgaria,,,,1,1,25,,,,,,,62,1,171,1,21.203106,,2,,,,,,,,,,3,
30626515,,Bulgaria,,,,1,1,21,,,,,,,59,1,176,1,19.047005,,2,,,,,,,,,,3,
30626516,,Bulgaria,,,,1,1,60,,,,,,,74,1,165,1,27.180901,,3,,,,,0,,0,,,3,
30626517,,Bulgaria,,,,1,2,54,,,,,,,80,1,157,1,32.455677,,4,,,,,3,,0,,,3,
30626518,,Bulgaria,,,,1,1,40,,,,,,,75,1,171,1,25.648918,,3,,,,,3,,0,,,3,
30626519,,Bulgaria,,,,1,2,52,,,,,,,80,1,158,1,32.046146,,4,,,,,0,,6,Diet related to health condition (condition unspecified),,1,
30626520,,Bulgaria,,,,1,2,39,,,,,,,62,1,154,1,26.142689,,3,,,,,0,,0,,,3,
30626521,,Bulgaria,,,,1,2,59,,,,,,,75,1,150,1,33.333332,,4,,,,,0,,0,,,3,
30626522,,Bulgaria,,,,1,2,64,,,,,,,64,1,144,1,30.864197,,4,,,,,3,,0,,,3,
30626523,,Bulgaria,,,,1,2,18,,,,,,,47,1,155,1,,,,,,,,0,,0,,,1,19.562956
30626524,,Bulgaria,,,,1,1,17,,,,,,,68,1,176,1,,,,,,,,0,,0,,,1,21.952478
30626525,,Bulgaria,,,,1,2,16,,,,,,,50,1,162,1,,,,,,,,0,,0,,,1,19.051973
30626526,,Bulgaria,,,,1,2,16,,,,,,,52,1,168,1,,,,,,,,0,,0,,,1,18.424036
30626527,,Bulgaria,,,,1,1,16,,,,,,,76,1,181,1,,,,,,,,,,,,,1,23.198315
30626528,,Bulgaria,,,,1,1,16,,,,,,,50,1,165,1,,,,,,,,,,,,,1,18.365473
30626529,,Bulgaria,,,,1,2,27,,,,,,,82,1,175,1,26.775511,,3,,,,,0,,0,,,1,
30626530,,Bulgaria,,,,1,2,20,,,,,,,63,1,172,1,21.295294,,2,,,,,0,,0,,,1,
30626531,,Bulgaria,,,,1,1,20,,,,,,,80,1,178,1,25.249338,,3,,,,,0,,0,,,1,
30626532,,Bulgaria,,,,1,2,23,,,,,,,56,1,165,1,20.56933,,2,,,,,,,,,,1,
30626533,,Bulgaria,,,,1,1,20,,,,,,,78,1,182,1,23.54788,,2,,,,,0,,0,,,1,
30626534,,Bulgaria,,,,1,1,22,,,,,,,81.300003,1,186,1,23.499828,,2,,,,,0,,0,,,1,
30626535,,Bulgaria,,,,1,2,33,,,,,,,63,1,168,1,22.321428,,2,,,,,0,,0,,,1,
30626536,,Bulgaria,,,,1,1,44,,,,,,,90,1,172,1,30.42185,,4,,,,,0,,0,,,1,
30626537,,Bulgaria,,,,1,2,37,,,,,,,50,1,160,1,19.53125,,2,,,,,0,,0,,,1,
30626538,,Bulgaria,,,,1,1,49,,,,,,,77,1,186,1,22.256908,,2,,,,,0,,0,,,1,
30626539,,Bulgaria,,,,1,2,56,,,,,,,68,1,163,1,25.593737,,3,,,,,0,,6,Diet related to health condition (condition unspecified),,1,
30626540,,Bulgaria,,,,1,2,32,,,,,,,90,1,175,1,29.387754,,3,,,,,0,,0,,,1,
30626541,,Bulgaria,,,,1,2,63,,,,,,,72,1,155,1,29.968782,,3,,,,,0,,0,,,1,
30626542,,Bulgaria,,,,1,2,64,,,,,,,59,1,150,1,26.222221,,3,,,,,3,,0,,,1,
30626543,,Bulgaria,,,,1,1,62,,,,,,,91,1,173,1,30.405293,,4,,,,,0,,0,,,1,
30626544,,Bulgaria,,,,1,1,23,,,,,,,78,1,178,1,24.618103,,2,,,,,3,,0,,,1,
30626545,,Bulgaria,,,,1,2,26,,,,,,,52,1,160,1,20.3125,,2,,,,,,,,,,1,
30626546,,Bulgaria,,,,1,2,26,,,,,,,75,1,167,1,26.892323,,3,,,,,3,,0,,,1,
30626547,,Bulgaria,,,,1,2,49,,,,,,,68,1,176,1,21.952478,,2,,,,,3,,0,,,1,
30626548,,Bulgaria,,,,1,2,48,,,,,,,75,1,165,1,27.54821,,3,,,,,0,,0,,,1,
30626549,,Bulgaria,,,,1,2,62,,,,,,,80,1,153,1,34.174889,,4,,,,,3,,0,,,1,
30626550,,Bulgaria,,,,1,1,62,,,,,,,78,1,182,1,23.54788,,2,,,,,0,,0,,,1,
30626551,,Bulgaria,,,,1,2,16,,,,,,,55.25,1,173,1,,,,,,,,0,,0,,,1,18.460356
30626552,,Bulgaria,,,,1,2,17,,,,,,,55.75,1,162,1,,,,,,,,0,,0,,,1,21.24295
30626553,,Bulgaria,,,,1,2,17,,,,,,,55,1,163.25,1,,,,,,,,,,,,,1,20.637463
30626554,,Bulgaria,,,,1,1,17,,,,,,,89,1,192,1,,,,,,,,0,,0,,,1,24.142796
30626555,,Bulgaria,,,,1,1,18,,,,,,,88,1,177.25,1,,,,,,,,0,,0,,,1,28.009811
30626556,,Bulgaria,,,,1,1,18,,,,,,,80,1,178.75,1,,,,,,,,,,,,,1,25.037899
30626557,,Bulgaria,,,,1,2,17,,,,,,,42,1,159.5,1,,,,,,,,0,,0,,,1,16.509272
30626558,,Bulgaria,,,,1,1,16,,,,,,,60,1,169,1,,,,,,,,0,,0,,,1,21.007668
30626559,,Bulgaria,,,,1,1,17,,,,,,,84,1,192,1,,,,,,,,0,,6,Diet related to health condition (condition unspecified),,1,22.786459
30626560,,Bulgaria,,,,1,1,20,,,,,,,56,1,174,1,18.496498,,1,,,,,0,,0,,,1,
30626561,,Bulgaria,,,,1,2,29,,,,,,,51.5,1,158.5,1,20.499756,,2,,,,,0,,0,,,1,
30626562,,Bulgaria,,,,1,1,21,,,,,,,85,1,180,1,26.234568,,3,,,,,0,,0,,,1,
30626563,,Bulgaria,,,,1,1,22,,,,,,,137,1,186.25,1,39.493717,,4,,,,,0,,0,,,1,
30626564,,Bulgaria,,,,1,2,30,,,,,,,61,1,167.75,1,21.67728,,2,,,,,,,,,,1,
30626565,,Bulgaria,,,,1,1,21,,,,,,,69.75,1,169.75,1,24.206091,,2,,,,,0,,0,,,1,
30626566,,Bulgaria,,,,1,1,20,,,,,,,84,1,170.75,1,28.810968,,3,,,,,0,,0,,,1,
30626567,,Bulgaria,,,,1,2,21,,,,,,,47,1,163,1,17.689789,,1,,,,,0,,0,,,1,
30626568,,Bulgaria,,,,1,2,19,,,,,,,71.25,1,158.75,1,,,,,,,,0,,0,,,1,28.272057
30626569,,Bulgaria,,,,1,2,20,,,,,,,50,1,150.5,1,22.074812,,2,,,,,3,,0,,,1,
30626570,,Bulgaria,,,,1,2,26,,,,,,,53,1,169.14999,1,18.523878,,2,,,,,,,,,,1,
30626571,,Bulgaria,,,,1,1,26,,,,,,,71.75,1,176,1,23.163094,,2,,,,,0,,6,Diet related to health condition (condition unspecified),,1,
30626572,,Bulgaria,,,,1,2,52,,,,,,,84,1,172,1,28.393726,,3,,,,,3,,0,,,1,
30626573,,Bulgaria,,,,1,1,47,,,,,,,95.25,1,176,1,30.749613,,4,,,,,3,,0,,,1,
30626574,,Bulgaria,,,,1,1,43,,,,,,,199,1,185,1,58.14463,,4,,,,,0,,0,,,1,
30626575,,Bulgaria,,,,1,1,51,,,,,,,74,1,170,1,25.605536,,3,,,,,3,,0,,,1,
30626576,,Bulgaria,,,,1,1,35,,,,,,,109.5,1,189.5,1,30.492687,,4,,,,,0,,0,,,1,
30626577,,Bulgaria,,,,1,1,58,,,,,,,82.75,1,171.25,1,28.21674,,3,,,,,0,,0,,,1,
30626578,,Bulgaria,,,,1,1,40,,,,,,,78,1,179.5,1,24.208378,,2,,,,,0,,0,,,1,
30626579,,Bulgaria,,,,1,2,41,,,,,,,56,1,159.5,1,22.012362,,2,,,,,0,,0,,,1,
30626580,,Bulgaria,,,,1,2,54,,,,,,,109,1,162.25,1,41.405411,,4,,,,,0,,0,,,1,
30626581,,Bulgaria,,,,1,2,60,,,,,,,55,1,150,1,24.444445,,2,,,,,0,,0,,,1,
30626582,,Bulgaria,,,,1,2,32,,,,,,,55.5,1,167,1,19.90032,,2,,,,,0,,0,,,1,
30626583,,Bulgaria,,,,1,2,53,,,,,,,76,1,160.5,1,29.502819,,3,,,,,0,,0,,,1,
30626584,,Bulgaria,,,,1,1,62,,,,,,,80,1,178,1,25.249338,,3,,,,,0,,0,,,1,
30626585,,Bulgaria,,,,1,1,64,,,,,,,75,1,175.5,1,24.350452,,2,,,,,0,,0,,,1,
30626586,,Bulgaria,,,,1,1,16,,,,,,,68,1,168,1,,,,,,,,0,,0,,,1,24.09297
30626587,,Bulgaria,,,,1,2,17,,,,,,,50,1,157,1,,,,,,,,3,,0,,,1,20.284798
30626588,,Bulgaria,,,,1,1,16,,,,,,,65,1,184,1,,,,,,,,0,,0,,,1,19.198959
30626589,,Bulgaria,,,,1,2,16,,,,,,,54,1,159,1,,,,,,,,,,,,,1,21.359915
30626590,,Bulgaria,,,,1,2,17,,,,,,,60,1,165,1,,,,,,,,3,,0,,,1,22.038567
30626591,,Bulgaria,,,,1,2,17,,,,,,,60,1,165,1,,,,,,,,0,,0,,,1,22.038567
30626592,,Bulgaria,,,,1,2,19,,,,,,,55,1,156,1,,,,,,,,,,,,,2,22.600264
30626593,,Bulgaria,,,,1,2,19,,,,,,,75,1,166,1,,,,,,,,3,,0,,,1,27.217302
30626594,,Bulgaria,,,,1,2,20,,,,,,,54,1,167,1,19.362473,,2,,,,,0,,0,,,1,
30626595,,Bulgaria,,,,1,2,21,,,,,,,56,1,168,1,19.84127,,2,,,,,0,,0,,,1,
30626596,,Bulgaria,,,,1,2,25,,,,,,,75,1,165,1,27.54821,,3,,,,,3,,0,,,1,
30626597,,Bulgaria,,,,1,2,26,,,,,,,65,1,168,1,23.030045,,2,,,,,0,,0,,,1,
30626598,,Bulgaria,,,,1,2,32,,,,,,,45,1,156,1,18.491125,,1,,,,,0,,0,,,1,
30626599,,Bulgaria,,,,1,2,31,,,,,,,60,1,172,1,20.281233,,2,,,,,0,,0,,,1,
30626600,,Bulgaria,,,,1,2,35,,,,,,,67,1,164,1,24.910767,,2,,,,,,,,,,1,
30626601,,Bulgaria,,,,1,2,44,,,,,,,70,1,167,1,25.099501,,3,,,,,0,,0,,,1,
30626602,,Bulgaria,,,,1,2,51,,,,,,,92,1,160,1,35.9375,,4,,,,,3,,0,,,1,
30626603,,Bulgaria,,,,1,2,55,,,,,,,70,1,173,1,23.388687,,2,,,,,0,,0,,,1,
30626604,,Bulgaria,,,,1,1,42,,,,,,,63,1,160,1,24.609375,,2,,,,,,,,,,1,
30626605,,Bulgaria,,,,1,1,16,,,,,,,82,1,180,1,,,,,,,,0,,0,,,1,25.308641
30626606,,Bulgaria,,,,1,1,16,,,,,,,81,1,181,1,,,,,,,,,,,,,1,24.72452
30626607,,Bulgaria,,,,1,1,16,,,,,,,78,1,176,1,,,,,,,,0,,0,,,1,25.180784
30626608,,Bulgaria,,,,1,1,16,,,,,,,80,1,178,1,,,,,,,,0,,0,,,1,25.249338
30626609,,Bulgaria,,,,1,1,20,,,,,,,72,1,178,1,22.724403,,2,,,,,0,,0,,,1,
30626610,,Bulgaria,,,,1,1,20,,,,,,,75,1,180,1,23.148148,,2,,,,,0,,0,,,1,
30626611,,Bulgaria,,,,1,1,20,,,,,,,80,1,182,1,24.151672,,2,,,,,0,,0,,,1,
30626612,,Bulgaria,,,,1,1,21,,,,,,,70,1,178,1,22.09317,,2,,,,,,,,,,1,
30626613,,Bulgaria,,,,1,1,21,,,,,,,80,1,185,1,23.374725,,2,,,,,0,,0,,,1,
30626614,,Bulgaria,,,,1,1,24,,,,,,,75,1,175,1,24.489796,,2,,,,,0,,0,,,1,
30626615,,Bulgaria,,,,1,1,25,,,,,,,70,1,174,1,23.120625,,2,,,,,0,,0,,,1,
30626616,,Bulgaria,,,,1,1,25,,,,,,,65,1,176,1,20.983988,,2,,,,,0,,0,,,1,
30626617,,Bulgaria,,,,1,1,36,,,,,,,70,1,174,1,23.120625,,2,,,,,0,,0,,,1,
30626618,,Bulgaria,,,,1,1,40,,,,,,,80,1,178,1,25.249338,,3,,,,,0,,0,,,1,
30626619,,Bulgaria,,,,1,1,53,,,,,,,105,1,180,1,32.407406,,4,,,,,3,,0,,,1,
30626620,,Bulgaria,,,,1,1,58,,,,,,,81.75,1,170.5,1,28.121532,,3,,,,,0,,0,,,1,
30626621,,Bulgaria,,,,1,1,60,,,,,,,80,1,172,1,27.041645,,3,,,,,,,,,,1,
30626622,,Bulgaria,,,,1,2,16,,,,,,,60,1,168,1,,,,,,,,0,,0,,,1,21.258503
30626623,,Bulgaria,,,,1,1,16,,,,,,,75,1,188.5,1,,,,,,,,,,,,,1,21.107586
30626624,,Bulgaria,,,,1,2,17,,,,,,,65.25,1,172,1,,,,,,,,0,,0,,,1,22.055841
30626625,,Bulgaria,,,,1,2,20,,,,,,,56.5,1,170.25,1,19.4928,,2,,,,,,,,,,1,
30626626,,Bulgaria,,,,1,1,20,,,,,,,66,1,182.75,1,19.761921,,2,,,,,,,,,,1,
30626627,,Bulgaria,,,,1,1,20,,,,,,,70.5,1,178,1,22.250978,,2,,,,,,,,,,1,
30626628,,Bulgaria,,,,1,1,22,,,,,,,88,1,182,1,26.566839,,3,,,,,0,,0,,,1,
30626629,,Bulgaria,,,,1,2,26,,,,,,,60.5,1,165,1,22.222221,,2,,,,,0,,0,,,1,
30626630,,Bulgaria,,,,1,1,19,,,,,,,75,1,180,1,,,,,,,,0,,0,,,1,23.148148
30626631,,Bulgaria,,,,1,2,34,,,,,,,50.75,1,155.75,1,20.920879,,2,,,,,3,,0,,,3,
30626632,,Bulgaria,,,,1,2,50,,,,,,,74,1,170,1,25.605536,,3,,,,,0,,0,,,1,
30626633,,Bulgaria,,,,1,2,54,,,,,,,78,1,168,1,27.636055,,3,,,,,3,,0,,,1,
30626634,,Bulgaria,,,,1,1,45,,,,,,,61.799999,1,178.25,1,19.450438,,2,,,,,,,,,,1,
30626635,,Bulgaria,,,,1,1,37,,,,,,,62.25,1,176,1,20.096203,,2,,,,,,,,,,1,
30626636,,Bulgaria,,,,1,1,36,,,,,,,75,1,175,1,24.489796,,2,,,,,,,,,,1,
30626637,,Bulgaria,,,,1,2,54,,,,,,,55,1,158,1,22.031725,,2,,,,,,,,,,1,
30626638,,Bulgaria,,,,1,2,55,,,,,,,73,1,156,1,29.996714,,3,,,,,3,,0,,,1,
30626639,,Bulgaria,,,,1,2,63,,,,,,,53,1,158,1,21.230572,,2,,,,,,,,,,1,
30626640,,Bulgaria,,,,1,1,61,,,,,,,97.5,1,186,1,28.182449,,3,,,,,3,,0,,,1,
30626641,,Bulgaria,,,,1,1,62,,,,,,,89.75,1,178,1,28.326601,,3,,,,,3,,0,,,1,
30626642,,Bulgaria,,,,1,1,16,,,,,,,72,1,180,1,,,,,,,,0,,0,,,1,22.222221
30626643,,Bulgaria,,,,1,1,16,,,,,,,75,1,175,1,,,,,,,,0,,6,Diet related to health condition (condition unspecified),,1,24.489796
30626644,,Bulgaria,,,,1,2,30,,,,,,,64,1,160,1,25,,3,,,,,0,,6,Diet related to health condition (condition unspecified),,1,
30626645,,Bulgaria,,,,1,2,19,,,,,,,55.25,1,162,1,,,,,,,,,,,,,1,21.052431
30626646,,Bulgaria,,,,1,2,24,,,,,,,47,1,153,1,20.077747,,2,,,,,0,,0,,,1,
30626647,,Bulgaria,,,,1,2,20,,,,,,,52.75,1,155,1,21.956295,,2,,,,,0,,0,,,1,
30626648,,Bulgaria,,,,1,1,27,,,,,,,70,1,174,1,23.120625,,2,,,,,0,,0,,,1,
30626649,,Bulgaria,,,,1,1,27,,,,,,,90,1,178,1,28.405504,,3,,,,,3,,0,,,1,
30626650,,Bulgaria,,,,1,1,25,,,,,,,81,1,174,1,26.753864,,3,,,,,,,,,,1,
30626651,,Bulgaria,,,,1,2,31,,,,,,,71.5,1,173,1,23.889874,,2,,,,,3,,0,,,1,
30626652,,Bulgaria,,,,1,2,46,,,,,,,47,1,155,1,19.562956,,2,,,,,0,,0,,,1,
30626653,,Bulgaria,,,,1,1,57,,,,,,,88,1,177,1,28.088991,,3,,,,,0,,0,,,1,
30626654,,Bulgaria,,,,1,1,43,,,,,,,80,1,181.5,1,24.284924,,2,,,,,0,,0,,,1,
30626655,,Bulgaria,,,,1,1,42,,,,,,,88,1,186,1,25.436466,,3,,,,,0,,0,,,1,
30626656,,Bulgaria,,,,1,2,18,,,,,,,49.5,1,155,1,,,,,,,,0,,0,,,1,20.603539
30626657,,Bulgaria,,,,1,2,27,,,,,,,50,1,160,1,19.53125,,2,,,,,0,,0,,,1,
30626658,,Bulgaria,,,,1,2,32,,,,,,,56,1,168,1,19.84127,,2,,,,,0,,0,,,1,
30626659,,Bulgaria,,,,1,2,48,,,,,,,89,1,164,1,33.090424,,4,,,,,3,,0,,,1,
30626660,,Bulgaria,,,,1,2,51,,,,,,,59,1,165,1,21.671259,,2,,,,,0,,0,,,1,
30626661,,Bulgaria,,,,1,2,63,,,,,,,100,1,162,1,38.103947,,4,,,,,0,,6,Diet related to health condition (condition unspecified),,1,
30626662,,Bulgaria,,,,1,1,16,,,,,,,59,1,168,1,,,,,,,,0,,0,,,1,20.904196
30626663,,Bulgaria,,,,1,1,16,,,,,,,70,1,180,1,,,,,,,,0,,0,,,1,21.604939
30626664,,Bulgaria,,,,1,1,21,,,,,,,72,1,170,1,24.913494,,2,,,,,0,,0,,,1,
30626665,,Bulgaria,,,,1,1,20,,,,,,,72,1,175,1,23.510204,,2,,,,,0,,0,,,1,
30626666,,Bulgaria,,,,1,1,32,,,,,,,100,1,189,1,27.994738,,3,,,,,0,,0,,,1,
30626667,,Bulgaria,,,,1,1,35,,,,,,,88,1,170,1,30.449827,,4,,,,,0,,0,,,3,
30626668,,Bulgaria,,,,1,1,60,,,,,,,74,1,167,1,26.533758,,3,,,,,0,,0,,,1,
30626669,,Bulgaria,,,,1,1,16,,,,,,,59,1,167,1,,,,,,,,0,,0,,,3,21.155294
30626670,,Bulgaria,,,,1,1,16,,,,,,,55,1,162,1,,,,,,,,0,,0,,,3,20.95717
30626671,,Bulgaria,,,,1,1,20,,,,,,,63,1,184,1,18.608223,,2,,,,,0,,0,,,1,
30626672,,Bulgaria,,,,1,1,22,,,,,,,81,1,183,1,24.187046,,2,,,,,0,,0,,,3,
30626673,,Bulgaria,,,,1,1,23,,,,,,,59,1,176,1,19.047005,,2,,,,,0,,0,,,3,
30626674,,Bulgaria,,,,1,1,48,,,,,,,90,1,160,1,35.15625,,4,,,,,0,,6,Diet related to health condition (condition unspecified),,3,
30626675,,Bulgaria,,,,1,1,59,,,,,,,78,1,165,1,28.650137,,3,,,,,0,,0,,,3,
30626676,,Bulgaria,,,,1,2,16,,,,,,,50,1,158,1,,,,,,,,0,,0,,,3,20.028841
30626677,,Bulgaria,,,,1,2,16,,,,,,,75,1,190,1,,,,,,,,0,,0,,,1,20.775623
30626678,,Bulgaria,,,,1,2,19,,,,,,,47,1,160,1,,,,,,,,0,,0,,,1,18.359375
30626679,,Bulgaria,,,,1,2,25,,,,,,,52,1,165,1,19.100092,,2,,,,,0,,0,,,3,
30626680,,Bulgaria,,,,1,2,53,,,,,,,75,1,164,1,27.885187,,3,,,,,3,,0,,,1,
30626681,,Bulgaria,,,,1,2,59,,,,,,,53,1,158,1,21.230572,,2,,,,,0,,0,,,3,
30626682,,Bulgaria,,,,1,2,63,,,,,,,78,1,164,1,29.000595,,3,,,,,0,,0,,,3,
30626683,,Bulgaria,,,,1,2,16,,,,,,,35,1,152,1,,,,,,,,,,,,,3,15.148892
30626684,,Bulgaria,,,,1,2,17,,,,,,,49,1,142,1,,,,,,,,0,,0,,,1,24.300734
30626685,,Bulgaria,,,,1,1,18,,,,,,,70,1,178,1,,,,,,,,0,,0,,,1,22.09317
30626686,,Bulgaria,,,,1,2,18,,,,,,,53.25,1,169.25,1,,,,,,,,0,,0,,,1,18.589266
30626687,,Bulgaria,,,,1,1,17,,,,,,,56,1,167,1,,,,,,,,,,,,,1,20.079601
30626688,,Bulgaria,,,,1,2,17,,,,,,,44.75,1,155.5,1,,,,,,,,0,,0,,,1,18.50684
30626689,,Bulgaria,,,,1,1,16,,,,,,,68.25,1,175.5,1,,,,,,,,0,,0,,,1,22.158911
30626690,,Bulgaria,,,,1,1,16,,,,,,,59.5,1,171,1,,,,,,,,0,,0,,,1,20.348141
30626691,,Bulgaria,,,,1,2,16,,,,,,,70,1,160,1,,,,,,,,0,,0,,,1,27.34375
30626692,,Bulgaria,,,,1,2,26,,,,,,,53.25,1,168.5,1,18.755117,,2,,,,,0,,0,,,1,
30626693,,Bulgaria,,,,1,1,25,,,,,,,68,1,175,1,22.204082,,2,,,,,0,,0,,,1,
30626694,,Bulgaria,,,,1,2,26,,,,,,,50,1,158.5,1,19.902676,,2,,,,,,,,,,1,
30626695,,Bulgaria,,,,1,1,19,,,,,,,60,1,170,1,,,,,,,,0,,0,,,1,20.761246
30626696,,Bulgaria,,,,1,2,24,,,,,,,57.5,1,165.5,1,20.992872,,2,,,,,3,,0,,,1,
30626697,,Bulgaria,,,,1,1,20,,,,,,,69,1,190,1,19.113573,,2,,,,,0,,0,,,1,
30626698,,Bulgaria,,,,1,2,22,,,,,,,65.25,1,167.5,1,23.256849,,2,,,,,0,,0,,,1,
30626699,,Bulgaria,,,,1,1,28,,,,,,,100,1,160,1,39.0625,,4,,,,,0,,0,,,1,
30626700,,Bulgaria,,,,1,2,50,,,,,,,74.75,1,170.5,1,25.713573,,3,,,,,,,,,,1,
30626701,,Bulgaria,,,,1,1,56,,,,,,,90.5,1,167.5,1,32.256626,,4,,,,,0,,0,,,1,
30626702,,Bulgaria,,,,1,2,53,,,,,,,90.5,1,162,1,34.484074,,4,,,,,0,,0,,,1,
30626703,,Bulgaria,,,,1,1,50,,,,,,,75,1,166,1,27.217302,,3,,,,,0,,0,,,3,
30626704,,Bulgaria,,,,1,2,44,,,,,,,76,1,160,1,29.6875,,3,,,,,0,,0,,,1,
30626705,,Bulgaria,,,,1,1,58,,,,,,,98.5,1,182.5,1,29.574028,,3,,,,,0,,6,Diet related to health condition (condition unspecified),,1,
30626706,,Bulgaria,,,,1,2,44,,,,,,,80.5,1,174,1,26.588717,,3,,,,,0,,0,,,1,
30626707,,Bulgaria,,,,1,1,39,,,,,,,82.5,1,185.5,1,23.975414,,2,,,,,0,,6,Diet related to health condition (condition unspecified),,1,
30626708,,Bulgaria,,,,1,2,48,,,,,,,56,1,155.5,1,23.159397,,2,,,,,0,,0,,,1,
30626709,,Bulgaria,,,,1,2,50,,,,,,,81.75,1,167,1,29.312632,,3,,,,,0,,6,Diet related to health condition (condition unspecified),,1,
30626710,,Bulgaria,,,,1,1,38,,,,,,,105,1,172,1,35.492157,,4,,,,,0,,0,,,1,
30626711,,Bulgaria,,,,1,2,63,,,,,,,85,1,170,1,29.411764,,3,,,,,0,,0,,,1,
30626712,,Bulgaria,,,,1,2,64,,,,,,,55,1,146,1,25.802214,,3,,,,,0,,0,,,1,
30626713,,Bulgaria,,,,1,1,17,,,,,,,91,1,193,1,,,,,,,,0,,6,Diet related to health condition (condition unspecified),,1,24.430185
30626714,,Bulgaria,,,,1,1,16,,,,,,,70,1,180,1,,,,,,,,0,,0,,,1,21.604939
30626715,,Bulgaria,,,,1,2,16,,,,,,,66,1,178,1,,,,,,,,0,,0,,,1,20.830704
30626716,,Bulgaria,,,,1,1,16,,,,,,,61,1,192,1,,,,,,,,0,,0,,,1,16.54731
30626717,,Bulgaria,,,,1,2,17,,,,,,,55,1,160,1,,,,,,,,,,,,,1,21.484375
30626718,,Bulgaria,,,,1,2,17,,,,,,,56,1,164,1,,,,,,,,,,,,,1,20.82094
30626719,,Bulgaria,,,,1,1,25,,,,,,,75,1,176,1,24.212294,,2,,,,,,,,,,1,
30626720,,Bulgaria,,,,1,1,28,,,,,,,78,1,175,1,25.469387,,3,,,,,,,,,,1,
30626721,,Bulgaria,,,,1,1,21,,,,,,,76,1,186,1,21.967857,,2,,,,,,,,,,1,
30626722,,Bulgaria,,,,1,1,23,,,,,,,78,1,180,1,24.074074,,2,,,,,,,,,,1,
30626723,,Bulgaria,,,,1,1,20,,,,,,,57,1,168,1,20.195578,,2,,,,,,,,,,1,
30626724,,Bulgaria,,,,1,1,21,,,,,,,74,1,185,1,21.621622,,2,,,,,0,,0,,,1,
30626725,,Bulgaria,,,,1,1,20,,,,,,,75,1,188,1,21.220009,,2,,,,,0,,0,,,1,
30626726,,Bulgaria,,,,1,2,22,,,,,,,70,1,163,1,26.346495,,3,,,,,0,,0,,,1,
30626727,,Bulgaria,,,,1,2,24,,,,,,,48,1,167,1,17.211086,,1,,,,,0,,0,,,1,
30626728,,Bulgaria,,,,1,2,26,,,,,,,59,1,166,1,21.410946,,2,,,,,0,,0,,,1,
30626729,,Bulgaria,,,,1,2,20,,,,,,,44,1,167,1,15.77683,,1,,,,,0,,0,,,1,
30626730,,Bulgaria,,,,1,2,27,,,,,,,56,1,164,1,20.82094,,2,,,,,0,,6,Diet related to health condition (condition unspecified),,1,
30626731,,Bulgaria,,,,1,2,29,,,,,,,48,1,162,1,18.289894,,1,,,,,0,,0,,,1,
30626732,,Bulgaria,,,,1,2,20,,,,,,,68,1,161,1,26.233557,,3,,,,,0,,0,,,1,
30626733,,Bulgaria,,,,1,1,53,,,,,,,90,1,190,1,24.930748,,2,,,,,0,,0,,,1,
30626734,,Bulgaria,,,,1,1,33,,,,,,,82,1,170,1,28.373703,,3,,,,,3,,0,,,1,
30626735,,Bulgaria,,,,1,1,56,,,,,,,99,1,181,1,30.218859,,4,,,,,3,,0,,,1,
30626736,,Bulgaria,,,,1,1,58,,,,,,,96,1,180,1,29.629629,,3,,,,,0,,0,,,1,
30626737,,Bulgaria,,,,1,1,32,,,,,,,115,1,176,1,37.125515,,4,,,,,0,,0,,,1,
30626738,,Bulgaria,,,,1,1,32,,,,,,,69,1,186,1,19.944502,,2,,,,,0,,0,,,1,
30626739,,Bulgaria,,,,1,2,49,,,,,,,70,1,175,1,22.857143,,2,,,,,0,,0,,,1,
30626740,,Bulgaria,,,,1,2,55,,,,,,,76,1,176,1,24.535124,,2,,,,,0,,0,,,1,
30626741,,Bulgaria,,,,1,2,32,,,,,,,62,1,162,1,23.624447,,2,,,,,,,,,,1,
30626742,,Bulgaria,,,,1,2,32,,,,,,,49,1,164,1,18.218323,,1,,,,,,,,,,1,
30626743,,Bulgaria,,,,1,2,40,,,,,,,67,1,161,1,25.847769,,3,,,,,0,,0,,,1,
30626744,,Bulgaria,,,,1,2,37,,,,,,,75,1,167,1,26.892323,,3,,,,,0,,0,,,1,
30626745,,Bulgaria,,,,1,2,62,,,,,,,73,1,163,1,27.47563,,3,,,,,0,,6,Diet related to health condition (condition unspecified),,1,
30626746,,Bulgaria,,,,1,2,62,,,,,,,77,1,155,1,32.04995,,4,,,,,0,,0,,,1,
30626747,,Bulgaria,,,,1,1,64,,,,,,,55,1,173,1,18.376825,,1,,,,,0,,0,,,1,
30626748,,Bulgaria,,,,1,1,62,,,,,,,96,1,176,1,30.991735,,4,,,,,0,,0,,,1,
30626749,,Bulgaria,,,,1,2,24,,,,,,,60,1,168,1,21.258503,,2,,,,,0,,0,,,1,
30626750,,Bulgaria,,,,1,2,23,,,,,,,45,1,160,1,17.578125,,1,,,,,0,,0,,,1,
30626751,,Bulgaria,,,,1,2,19,,,,,,,56,1,164,1,,,,,,,,,,,,,1,20.82094
30626752,,Bulgaria,,,,1,1,48,,,,,,,85.5,1,182,1,25.812099,,3,,,,,3,,0,,,1,
30626753,,Bulgaria,,,,1,1,38,,,,,,,73,1,179,1,22.783308,,2,,,,,0,,0,,,1,
30626754,,Bulgaria,,,,1,1,43,,,,,,,75,1,185,1,21.913805,,2,,,,,0,,0,,,1,
30626755,,Bulgaria,,,,1,2,35,,,,,,,71,1,165,1,26.078972,,3,,,,,3,,0,,,1,
30626756,,Bulgaria,,,,1,2,54,,,,,,,70,1,160,1,27.34375,,3,,,,,3,,0,,,3,
30626757,,Bulgaria,,,,1,2,37,,,,,,,58,1,164,1,21.564545,,2,,,,,0,,0,,,1,
30626758,,Bulgaria,,,,1,2,34,,,,,,,66,1,158,1,26.43807,,3,,,,,0,,0,,,3,
30626759,,Bulgaria,,,,1,2,48,,,,,,,56,1,158,1,22.432302,,2,,,,,0,,6,Diet related to health condition (condition unspecified),,1,
30626760,,Bulgaria,,,,1,2,45,,,,,,,64,1,162,1,24.386526,,2,,,,,3,,0,,,1,
30626761,,Bulgaria,,,,1,1,16,,,,,,,70,1,179.25,1,,,,,,,,0,,0,,,1,21.786112
30626762,,Bulgaria,,,,1,2,18,,,,,,,55,1,159,1,,,,,,,,0,,0,,,1,21.755468
30626763,,Bulgaria,,,,1,2,16,,,,,,,50,1,163,1,,,,,,,,0,,0,,,1,18.818924
30626764,,Bulgaria,,,,1,1,17,,,,,,,75,1,175,1,,,,,,,,3,,0,,,1,24.489796
30626765,,Bulgaria,,,,1,1,17,,,,,,,61.75,1,181,1,,,,,,,,0,,0,,,1,18.848631
30626766,,Bulgaria,,,,1,2,16,,,,,,,55,1,171.5,1,,,,,,,,3,,0,,,1,18.699692
30626767,,Bulgaria,,,,1,1,16,,,,,,,55.5,1,172,1,,,,,,,,0,,0,,,1,18.760141
30626768,,Bulgaria,,,,1,2,24,,,,,,,54,1,160,1,21.09375,,2,,,,,0,,0,,,1,
30626769,,Bulgaria,,,,1,2,28,,,,,,,51,1,160,1,19.921875,,2,,,,,0,,0,,,1,
30626770,,Bulgaria,,,,1,2,19,,,,,,,59.5,1,165,1,,,,,,,,3,,0,,,1,21.854914
30626771,,Bulgaria,,,,1,2,26,,,,,,,58,1,162,1,22.10029,,2,,,,,,,,,,3,
30626772,,Bulgaria,,,,1,1,22,,,,,,,63.5,1,173,1,21.216881,,2,,,,,0,,0,,,1,
30626773,,Bulgaria,,,,1,1,24,,,,,,,72,1,182,1,21.736506,,2,,,,,,,,,,1,
30626774,,Bulgaria,,,,1,1,29,,,,,,,90,1,185,1,26.296566,,3,,,,,0,,0,,,1,
30626775,,Bulgaria,,,,1,2,33,,,,,,,70,1,168,1,24.801588,,2,,,,,,,,,,1,
30626776,,Bulgaria,,,,1,2,37,,,,,,,71,1,158,1,28.440954,,3,,,,,3,,0,,,1,
30626777,,Bulgaria,,,,1,2,49,,,,,,,62,1,155,1,25.806452,,3,,,,,0,,0,,,1,
30626778,,Bulgaria,,,,1,2,33,,,,,,,57,1,172,1,19.267172,,2,,,,,0,,0,,,1,
30626779,,Bulgaria,,,,1,1,51,,,,,,,106.5,1,172,1,35.999187,,4,,,,,0,,0,,,1,
30626780,,Bulgaria,,,,1,1,52,,,,,,,80,1,167,1,28.685144,,3,,,,,0,,0,,,1,
30626781,,Bulgaria,,,,1,1,34,,,,,,,85.5,1,177,1,27.291008,,3,,,,,0,,0,,,1,
30626782,,Bulgaria,,,,1,1,24,,,,,,,81.5,1,170,1,28.200691,,3,,,,,0,,0,,,1,
30626783,,Bulgaria,,,,1,2,63,,,,,,,70,1,160,1,27.34375,,3,,,,,0,,6,Diet related to health condition (condition unspecified),,3,
30626784,,Bulgaria,,,,1,2,63,,,,,,,84,1,164.5,1,31.041842,,4,,,,,0,,0,,,1,
30626785,,Bulgaria,,,,1,1,16,,,,,,,66,1,172,1,,,,,,,,0,,0,,,1,22.309357
30626786,,Bulgaria,,,,1,2,16,,,,,,,54.75,1,173,1,,,,,,,,3,,0,,,1,18.293295
30626787,,Bulgaria,,,,1,2,17,,,,,,,49.5,1,163,1,,,,,,,,0,,0,,,4,18.630735
30626788,,Bulgaria,,,,1,2,17,,,,,,,53.5,1,163,1,,,,,,,,0,,0,,,1,20.13625
30626789,,Bulgaria,,,,1,1,17,,,,,,,87.25,1,176.5,1,,,,,,,,3,,0,,,1,28.007608
30626790,,Bulgaria,,,,1,1,31,,,,,,,82,1,178,1,25.880571,,3,,,,,0,,0,,,1,
30626791,,Bulgaria,,,,1,1,27,,,,,,,85,1,182,1,25.661152,,3,,,,,0,,0,,,1,
30626792,,Bulgaria,,,,1,1,29,,,,,,,70,1,180,1,21.604939,,2,,,,,0,,0,,,1,
30626793,,Bulgaria,,,,1,1,16,,,,,,,70.25,1,176,1,,,,,,,,,,,,,1,22.678848
30626794,,Bulgaria,,,,1,1,16,,,,,,,75,1,173,1,,,,,,,,,,,,,1,25.059307
30626795,,Bulgaria,,,,1,1,16,,,,,,,67,1,175.5,1,,,,,,,,,,,,,1,21.753071
30626796,,Bulgaria,,,,1,2,17,,,,,,,53.5,1,167,1,,,,,,,,,,,,,1,19.183191
30626797,,Bulgaria,,,,1,1,19,,,,,,,51.5,1,165,1,,,,,,,,0,,0,,,1,18.916437
30626798,,Bulgaria,,,,1,1,20,,,,,,,74,1,171.5,1,25.159584,,3,,,,,,,,,,1,